{
  "npmci": {
    "npmAccessLevel": "public"
  },
  "gitzone": {
    "projectType": "npm",
    "module": {
      "githost": "gitlab.com",
      "gitscope": "push.rocks",
      "gitrepo": "smartmustache",
      "description": "templates done right",
      "npmPackagename": "@push.rocks/smartmustache",
      "license": "MIT"
    }
  }
}