{
  "gitzone": {
    "projectType": "npm",
    "module": {
      "githost": "gitlab.com",
      "gitscope": "push.rocks",
      "gitrepo": "smartlog-source-ora",
      "shortDescription": "a smartlog source wrapping ora for local display",
      "npmPackagename": "@push.rocks/smartlog-source-ora",
      "license": "MIT",
      "projectDomain": "push.rocks"
    }
  },
  "npmci": {
    "npmGlobalTools": [],
    "npmAccessLevel": "public"
  }
}