{
  "npmci": {
    "npmGlobalTools": [],
    "npmAccessLevel": "public"
  },
  "gitzone": {
    "projectType": "npm",
    "module": {
      "githost": "gitlab.com",
      "gitscope": "push.rocks",
      "gitrepo": "smartlog-destination-devtools",
      "shortDescription": "beautiful logging for the browser",
      "npmPackagename": "@push.rocks/smartlog-destination-devtools",
      "license": "MIT"
    }
  }
}