{
  "npmci": {
    "npmGlobalpmTools": [],
    "npmAccessLevel": "public"
  },
  "gitzone": {
    "projectType": "npm",
    "module": {
      "githost": "gitlab.com",
      "gitscope": "push.rocks",
      "gitrepo": "smartdrive",
      "shortDescription": "a module for drive data and mount management",
      "npmPackagename": "@push.rocks/smartdrive",
      "license": "MIT"
    }
  }
}