{
  "gitzone": {
    "projectType": "npm",
    "module": {
      "githost": "gitlab.com",
      "gitscope": "push.rocks",
      "gitrepo": "levelcache",
      "description": "a cache that uses memory/disk/s3 as backup",
      "npmPackagename": "@push.rocks/levelcache",
      "license": "MIT",
      "projectDomain": "push.rocks"
    }
  },
  "npmci": {
    "npmGlobalTools": [],
    "npmAccessLevel": "public"
  }
}