{
  "npmts": {
    "mode": "default"
  },
  "npmci": {
    "npmGlobalTools": [],
    "npmAccessLevel": "public"
  },
  "gitzone": {
    "module": {
      "githost": "gitlab.com",
      "gitscope": "push.rocks",
      "gitrepo": "gulp-function",
      "shortDescription": "accepts a function call as parameter to execute in gulp pipeline",
      "npmPackagename": "@push.rocks/gulp-function",
      "license": "MIT"
    }
  }
}