{
  "gitzone": {
    "projectType": "npm",
    "module": {
      "githost": "gitlab.com",
      "gitscope": "consentsoftware",
      "gitrepo": "consenttuples",
      "description": "npm package combining explanations and consent levels for several known third party analytics and tracking providers",
      "npmPackagename": "@consentsoftware/consenttuples",
      "license": "MIT",
      "projectDomain": "consent.software"
    }
  },
  "npmci": {
    "npmGlobalTools": [],
    "npmAccessLevel": "public"
  }
}