{
  "gitzone": {
    "projectType": "npm",
    "module": {
      "githost": "gitlab.com",
      "gitscope": "bellini",
      "gitrepo": "interfaces",
      "shortDescription": "an interface package for the bellini ecosystem",
      "npmPackagename": "@bellini/interfaces",
      "license": "MIT",
      "projectDomain": "bellini.io"
    }
  },
  "npmci": {
    "npmGlobalTools": [],
    "npmAccessLevel": "public"
  }
}