{
  "npmci": {
    "npmGlobalTools": [],
    "npmAccessLevel": "public"
  },
  "gitzone": {
    "module": {
      "githost": "gitlab.com",
      "gitscope": "mojoio",
      "gitrepo": "digitalocean",
      "shortDescription": "an unofficial DigitalOcean API abstraction package by Lossless GmbH",
      "npmPackagename": "@mojoio/digitalocean",
      "license": "MIT"
    }
  }
}