{
  "npmci": {
    "npmGlobalTools": [],
    "npmAccessLevel": "public",
    "npmRegistryUrl": "registry.npmjs.org"
  },
  "gitzone": {
    "projectType": "npm",
    "module": {
      "githost": "gitlab.com",
      "gitscope": "mojoio",
      "gitrepo": "sevdesk",
      "shortDescription": "mojoio integration package for sevdesk",
      "npmPackagename": "@mojoio/sevdesk",
      "license": "MIT"
    }
  }
}