{
  "gitzone": {
    "projectType": "npm",
    "module": {
      "githost": "gitlab.com",
      "gitscope": "api.global",
      "gitrepo": "typedrequest-interfaces",
      "description": "interfaces for making typed requests",
      "npmPackagename": "@api.global/typedrequest-interfaces",
      "license": "MIT",
      "projectDomain": "api.global"
    }
  },
  "npmci": {
    "npmGlobalTools": [],
    "npmAccessLevel": "public"
  }
}