{
  "gitzone": {
    "projectType": "npm",
    "module": {
      "githost": "gitlab.com",
      "gitscope": "apiglobal",
      "gitrepo": "sdk",
      "description": "an sdk package for api.global",
      "npmPackagename": "@apiglobal/sdk",
      "license": "MIT",
      "projectDomain": "api.global"
    }
  },
  "npmci": {
    "npmGlobalTools": [],
    "npmAccessLevel": "public"
  }
}