%YAML 1.1
%TAG !u! tag:unity3d.com,2011:
--- !u!114 &11400000
MonoBehaviour:
  m_ObjectHideFlags: 0
  m_CorrespondingSourceObject: {fileID: 0}
  m_PrefabInstance: {fileID: 0}
  m_PrefabAsset: {fileID: 0}
  m_GameObject: {fileID: 0}
  m_Enabled: 1
  m_EditorHideFlags: 0
  m_Script: {fileID: 11500000, guid: a116a0463dbeb9a4cb4c6d1729603f4d, type: 3}
  m_Name: SkillMod_RadiusBonus
  m_EditorClassIdentifier: 
  m_StatsModifiers:
    force: 0
    range: 0
    radius: 25
  m_ModifierType: 2
