<svg width="170" height="22" viewBox="0 0 170 22" fill="none" xmlns="http://www.w3.org/2000/svg">
<path d="M44.8081 19.9859C43.6056 20.7787 41.7003 21.1285 39.7084 21.1285C33.3795 21.1285 29.802 17.3178 29.802 11.2521C29.802 5.38955 33.3795 1.28577 39.6517 1.28577C41.5271 1.28577 43.4024 1.63885 44.7815 2.61816V5.1697C43.4024 4.29032 41.8802 3.83731 39.6517 3.83731C35.1382 3.83731 32.4401 6.8352 32.4401 11.2521C32.4401 15.669 35.2249 18.6102 39.7983 18.6102C41.5338 18.6261 43.2475 18.2239 44.7948 17.4377L44.8081 19.9859Z" fill="white"/>
<path d="M46.6501 13.4839C46.6501 9.087 49.2283 5.89258 53.6252 5.89258C58.0221 5.89258 60.5437 9.087 60.5437 13.4839C60.5437 17.8808 57.9922 21.1452 53.6252 21.1452C49.2583 21.1452 46.6501 17.8808 46.6501 13.4839ZM49.1117 13.4839C49.1117 16.2686 50.4908 18.7902 53.6252 18.7902C56.7597 18.7902 58.0821 16.2686 58.0821 13.4839C58.0821 10.6992 56.7497 8.23759 53.6286 8.23759C50.5074 8.23759 49.1184 10.6992 49.1184 13.4839H49.1117Z" fill="white"/>
<path d="M75.9396 20.8421H73.418V11.9917C73.418 9.35353 72.3621 8.18102 69.9605 8.18102C67.6288 8.18102 66.0033 9.73326 66.0033 12.6945V20.8421H63.4817V6.18576H66.0033V8.59073C66.4519 7.75841 67.1216 7.06607 67.9385 6.59001C68.7555 6.11394 69.688 5.87262 70.6333 5.89263C74.0043 5.89263 75.9396 8.22432 75.9396 12.2548V20.8421Z" fill="white"/>
<path d="M82.9579 6.18574H86.7386V8.51744H82.9579V20.8421H80.4963V8.51744H78.1213V6.18574H80.4963V4.57354C80.4963 1.84879 82.0219 9.41666e-05 85.1597 9.41666e-05C85.7342 -0.00310856 86.3062 0.0754005 86.8585 0.233263V2.56496C86.337 2.46578 85.8072 2.4167 85.2763 2.41839C83.7241 2.41839 82.9446 3.32775 82.9446 4.64683L82.9579 6.18574Z" fill="white"/>
<path d="M93.3806 20.9286C90.9756 20.9286 89.4534 19.7861 89.4534 17.088V0.0599365H91.9749V16.7948C91.9749 18.1272 92.8543 18.5836 93.9402 18.5836C94.1849 18.5876 94.4295 18.5776 94.673 18.5536V20.812C94.2485 20.903 93.8145 20.9422 93.3806 20.9286Z" fill="white"/>
<path d="M96.8081 6.18567H99.3297V15.0361C99.3297 17.6743 100.386 18.8468 102.787 18.8468C105.119 18.8468 106.744 17.2945 106.744 14.3333V6.18567H109.273V20.842H106.751V18.437C106.302 19.2694 105.633 19.9617 104.816 20.4378C103.999 20.9138 103.066 21.1552 102.121 21.1352C98.7501 21.1352 96.8148 18.8035 96.8148 14.7763L96.8081 6.18567Z" fill="white"/>
<path d="M120.082 21.1352C114.599 21.1352 112.197 17.9707 112.197 13.4739C112.197 9.04701 114.659 5.88257 119.116 5.88257C123.629 5.88257 125.445 9.02036 125.445 13.4739V14.6164H114.749C115.102 17.108 116.714 18.7202 120.172 18.7202C121.692 18.7188 123.201 18.4505 124.629 17.9274V20.2591C123.423 20.8987 121.577 21.1352 120.082 21.1352ZM114.719 12.4746H122.896C122.75 9.74985 121.517 8.19428 118.999 8.19428C116.331 8.17762 114.982 9.9064 114.719 12.4579V12.4746Z" fill="white"/>
<path d="M140.894 20.8421H138.372V11.9917C138.372 9.35353 137.316 8.18102 134.915 8.18102C132.583 8.18102 130.958 9.73326 130.958 12.6945V20.8421H128.436V6.18576H130.958V8.59073C131.406 7.75841 132.076 7.06607 132.893 6.59001C133.71 6.11394 134.642 5.87262 135.588 5.89263C138.959 5.89263 140.894 8.22432 140.894 12.2548V20.8421Z" fill="white"/>
<path d="M154.761 20.459C153.881 20.9286 152.532 21.1252 151.183 21.1252C145.967 21.1252 143.522 17.9607 143.522 13.4639C143.522 9.03701 145.954 5.87257 151.183 5.87257C152.385 5.83317 153.579 6.07379 154.671 6.57541V8.90711C153.636 8.41976 152.503 8.17917 151.36 8.20427C147.549 8.20427 145.997 10.6092 145.997 13.4506C145.997 16.2919 147.579 18.7302 151.416 18.7302C152.55 18.7601 153.679 18.5817 154.747 18.2039L154.761 20.459Z" fill="white"/>
<path d="M164.637 21.1352C159.154 21.1352 156.753 17.9707 156.753 13.4739C156.753 9.04701 159.214 5.88257 163.671 5.88257C168.185 5.88257 170 9.02036 170 13.4739V14.6164H159.301C159.654 17.108 161.266 18.7202 164.724 18.7202C166.244 18.7188 167.753 18.4505 169.181 17.9274V20.2591C167.978 20.8987 166.133 21.1352 164.637 21.1352ZM159.274 12.4746H167.452C167.305 9.74985 166.073 8.19428 163.555 8.19428C160.886 8.17762 159.537 9.9064 159.274 12.4579V12.4746Z" fill="white"/>
<path d="M0.759064 16.4984C0.54255 16.8515 0.299387 17.2612 0.092866 17.5876C0.00400605 17.7378 -0.022395 17.9168 0.0193372 18.0862C0.0610694 18.2556 0.167604 18.4019 0.316042 18.4936L4.64633 21.1584C4.72158 21.2049 4.80532 21.2359 4.89268 21.2497C4.98004 21.2634 5.06926 21.2596 5.15514 21.2386C5.24103 21.2175 5.32186 21.1795 5.39291 21.1269C5.46397 21.0742 5.52383 21.0079 5.56901 20.9319C5.74223 20.6421 5.9654 20.2657 6.20856 19.8627C7.92402 17.0313 9.64948 17.3778 12.7606 18.8634L17.0543 20.9053C17.1348 20.9436 17.2221 20.9654 17.3112 20.9693C17.4002 20.9732 17.4892 20.9592 17.5727 20.9282C17.6563 20.8971 17.7327 20.8496 17.7976 20.7885C17.8625 20.7273 17.9144 20.6538 17.9503 20.5722L20.0122 15.9088C20.0822 15.7487 20.0865 15.5675 20.0242 15.4043C19.9619 15.241 19.838 15.1088 19.6791 15.0361C18.7731 14.6097 16.971 13.7603 15.3488 12.9775C9.51291 10.1428 4.55306 10.3261 0.759064 16.4984Z" fill="url(#paint0_linear_105_187)"/>
<path d="M20.1753 5.91591C20.3918 5.56283 20.635 5.15311 20.8415 4.82668C20.9304 4.67652 20.9568 4.49748 20.915 4.32806C20.8733 4.15864 20.7668 4.01236 20.6183 3.92065L16.288 1.25586C16.2122 1.2048 16.1267 1.16988 16.0368 1.15329C15.947 1.13669 15.8546 1.13877 15.7656 1.15939C15.6765 1.18001 15.5927 1.21873 15.5192 1.27315C15.4458 1.32757 15.3844 1.39651 15.3387 1.4757C15.1655 1.7655 14.9423 2.1419 14.6992 2.54495C12.9837 5.37629 11.2582 5.02987 8.1471 3.54425L3.86678 1.51234C3.78629 1.47403 3.69893 1.45226 3.60987 1.44833C3.52082 1.44439 3.43188 1.45837 3.34833 1.48943C3.26477 1.52049 3.1883 1.56801 3.12344 1.62916C3.05858 1.69031 3.00666 1.76386 2.97074 1.84544L0.908856 6.50883C0.838837 6.66892 0.834515 6.8501 0.896822 7.01335C0.959129 7.17659 1.08308 7.30882 1.24196 7.38155C2.14798 7.80791 3.95005 8.65732 5.57224 9.4401C11.4215 12.2714 16.3813 12.0816 20.1753 5.91591Z" fill="url(#paint1_linear_105_187)"/>
<defs>
<linearGradient id="paint0_linear_105_187" x1="19.8956" y1="22.5341" x2="6.79482" y2="15.0061" gradientUnits="userSpaceOnUse">
<stop offset="0.18" stop-color="white"/>
<stop offset="1" stop-color="#A7A7A7"/>
</linearGradient>
<linearGradient id="paint1_linear_105_187" x1="1.03876" y1="-0.123173" x2="14.1429" y2="7.4082" gradientUnits="userSpaceOnUse">
<stop offset="0.18" stop-color="white"/>
<stop offset="1" stop-color="#B1B1B1"/>
</linearGradient>
</defs>
</svg>
