<svg width="30" height="34" viewBox="0 0 30 34" fill="none" xmlns="http://www.w3.org/2000/svg">
<path fill-rule="evenodd" clip-rule="evenodd" d="M9 0.5C9.82843 0.5 10.5 1.17157 10.5 2V3.5L19.5 3.5V2C19.5 1.17157 20.1716 0.5 21 0.5C21.8284 0.5 22.5 1.17157 22.5 2V3.5L25.5 3.5C27.9853 3.5 30 5.51472 30 8L30 29C30 31.4853 27.9853 33.5 25.5 33.5L4.5 33.5C2.01472 33.5 0 31.4853 0 29L0 8C0 5.51472 2.01472 3.5 4.5 3.5L7.5 3.5L7.5 2C7.5 1.17157 8.17157 0.5 9 0.5ZM7.5 6.5L4.5 6.5C3.67157 6.5 3 7.17157 3 8L3 12.5L27 12.5V8C27 7.17157 26.3284 6.5 25.5 6.5L22.5 6.5L22.5 8C22.5 8.82843 21.8284 9.5 21 9.5C20.1716 9.5 19.5 8.82843 19.5 8L19.5 6.5L10.5 6.5V8C10.5 8.82843 9.82843 9.5 9 9.5C8.17157 9.5 7.5 8.82843 7.5 8V6.5ZM27 15.5L3 15.5L3 29C3 29.8284 3.67157 30.5 4.5 30.5L25.5 30.5C26.3284 30.5 27 29.8284 27 29L27 15.5Z" fill="black"/>
</svg>
