{
  "restartable": "rs",
  "ignore": [".git", "node_modules/", "dist/"],
  "watch": ["src/"],
  "exec": "ts-node --files ./src/index.ts",
  "execMap": {
    "ts": "ts-node"
  },
  "env": {
    "NODE_ENV": ".env"
  },
  "ext": "js,json,ts",
  "include": [
      "./src/**/*",
      "types-declaration/declaration.d.ts"
  ]
}