@startuml

title Functional model (with attributes)

/' = = = = = = = STYLE = = = = = = = '/
left to right direction
hide empty methods
hide <<assoc>> circle
skinparam class {
    BackgroundColor<<django.auth>> lightgreen
}

/' = = = = = = = MACRO = = = = = = = '/
!define rel(a,b,c,d,e) a "b" c "d" e
!define att(n,u,s) n : u

/' = = = = = = = CLASSES = = = = = = = '/
!include part/classes.iuml
rel(foo,*,--,*,bar)

/' = = = = = = = ATTRIBUTES = = = = = = = '/
!include part/attributes.iuml

/' = = = = = = = LEGEND = = = = = = = '/
legend
    Render //with// attributes
    Data **are shared** within **different** files :
    * classes
    * relations
    * attributs
    -> __stay D.R.Y.__ <-
endlegend

@enduml
