{
  "kind": "collectionType",
  "collectionName": "news_kategorien",
  "info": {
    "singularName": "news-kategorie",
    "pluralName": "news-kategorien",
    "displayName": "news-kategorie"
  },
  "options": {
    "draftAndPublish": true
  },
  "pluginOptions": {},
  "attributes": {
    "name": {
      "type": "string"
    }
  }
}
