<?xml version="1.0" encoding="UTF-8" standalone="no"?>
<!DOCTYPE svg PUBLIC "-//W3C//DTD SVG 1.1//EN" "http://www.w3.org/Graphics/SVG/1.1/DTD/svg11.dtd">
<svg width="100%" height="100%" viewBox="0 0 1418 624" version="1.1" xmlns="http://www.w3.org/2000/svg" xmlns:xlink="http://www.w3.org/1999/xlink" xml:space="preserve" xmlns:serif="http://www.serif.com/" style="fill-rule:evenodd;clip-rule:evenodd;stroke-linejoin:round;stroke-miterlimit:2;">
    <rect id="sponsor_mayr" x="0" y="0" width="1417.32" height="623.622" style="fill:none;"/>
    <g id="sponsor_mayr1" serif:id="sponsor_mayr">
        <g>
            <path d="M1063.88,557.102c0,1.557 0.131,3.893 0.519,6.877c0.26,2.076 0.522,3.765 1.038,5.322c0.263,0.648 0.651,1.426 1.17,2.205c0.388,0.519 0.779,1.038 1.298,1.426c0.647,0.391 1.166,0.519 1.817,0.519c0.647,0.129 1.297,-0.128 1.814,-0.388c0.65,-0.39 1.169,-0.778 1.557,-1.3c0.65,-0.779 1.038,-1.814 1.429,-2.724c0.65,-1.817 1.038,-3.762 1.298,-5.839c0.131,-1.945 0.259,-4.024 0.259,-6.098c0,-2.205 -0.128,-4.284 -0.259,-6.098c-0.26,-2.077 -0.648,-4.022 -1.298,-5.711c-0.391,-1.038 -0.779,-1.948 -1.429,-2.852c-0.388,-0.522 -0.907,-0.91 -1.557,-1.3c-0.517,-0.26 -1.167,-0.388 -1.814,-0.388c-0.651,-0 -1.301,0.256 -1.817,0.519c-0.391,0.388 -0.91,0.907 -1.298,1.426c-0.519,0.779 -0.907,1.426 -1.17,2.205c-0.516,1.557 -0.778,3.374 -1.038,5.322c-0.388,3.115 -0.519,5.32 -0.519,6.877m1.298,-66.829l-17.128,-0l-0,97.582l17.128,0l-0,-6.876c0.391,0.778 0.779,1.426 1.038,1.816c0.65,1.167 1.558,2.336 2.596,3.244c0.91,0.907 2.076,1.685 3.114,2.076c1.427,0.519 2.984,0.91 4.672,0.91c1.558,-0.131 3.115,-0.391 4.541,-1.041c2.596,-1.169 4.801,-3.112 6.358,-5.71c1.817,-2.984 3.246,-6.358 4.022,-9.989c1.041,-4.801 1.557,-9.863 1.557,-15.052c0,-5.451 -0.516,-10.901 -1.685,-15.961c-0.648,-3.246 -1.815,-6.23 -3.372,-8.825c-1.432,-2.465 -3.637,-4.41 -6.232,-5.711c-1.557,-0.778 -3.243,-1.166 -5.057,-1.166c-1.558,-0 -2.987,0.259 -4.284,0.778c-1.039,0.52 -2.205,1.167 -3.246,2.077c-1.036,1.038 -1.943,1.948 -2.593,2.983c-0.391,0.651 -0.907,1.686 -1.429,2.856l-0,-43.991Zm88.498,66.829c0,-1.557 -0.128,-3.893 -0.39,-6.877c-0.26,-1.948 -0.648,-3.765 -1.167,-5.322c-0.26,-0.648 -0.65,-1.426 -1.038,-2.205c-0.391,-0.519 -0.907,-1.038 -1.427,-1.426c-0.521,-0.263 -1.169,-0.519 -1.817,-0.519c-0.65,-0 -1.297,0.128 -1.819,0.388c-0.517,0.39 -1.036,0.778 -1.426,1.3c-0.648,0.904 -1.167,1.814 -1.427,2.852c-0.647,1.689 -1.038,3.634 -1.297,5.711c-0.26,1.945 -0.26,4.022 -0.26,6.098c-0.131,2.336 0,4.284 0.26,6.098c0.259,2.077 0.65,4.022 1.297,5.839c0.26,0.91 0.779,1.819 1.427,2.724c0.262,0.522 0.778,0.91 1.426,1.3c0.522,0.26 1.169,0.388 1.819,0.388c0.648,0 1.296,-0.128 1.817,-0.519c0.52,-0.388 1.036,-0.907 1.427,-1.426c0.388,-0.779 0.778,-1.426 1.038,-2.205c0.519,-1.557 0.907,-3.374 1.167,-5.322c0.262,-2.984 0.39,-5.32 0.39,-6.877m-1.169,-30.366l-0,7.528c-0.648,-1.17 -1.167,-2.205 -1.557,-2.856c-0.648,-1.035 -1.555,-1.945 -2.596,-2.983c-1.036,-0.91 -2.074,-1.557 -3.112,-2.077c-1.298,-0.519 -2.855,-0.778 -4.413,-0.778c-1.685,-0 -3.374,0.388 -4.931,1.166c-2.596,1.17 -4.801,3.115 -6.227,5.711c-1.557,2.595 -2.727,5.579 -3.505,8.825c-1.036,5.06 -1.558,10.51 -1.558,15.961c0,5.189 0.522,10.251 1.558,15.052c0.65,3.502 2.076,6.877 3.893,9.989c1.555,2.467 3.765,4.415 6.489,5.71c1.298,0.65 2.855,0.91 4.541,1.041c1.557,-0 3.115,-0.391 4.544,-0.91c1.164,-0.391 2.204,-1.169 3.112,-2.076c1.041,-0.908 1.945,-2.077 2.724,-3.244c0.259,-0.521 0.65,-1.169 1.038,-1.816l-0,6.876l17.128,0l-0,-61.119l-17.128,0Zm52.297,0l-0,44.379c0.131,2.987 1.038,5.97 2.467,8.437c1.557,2.853 4.281,5.32 7.784,7.006c3.505,1.688 7.398,2.467 11.42,2.467c3.894,-0.131 7.656,-1.041 10.899,-2.727c2.984,-1.557 5.579,-3.893 7.268,-6.617c1.557,-2.208 2.464,-4.801 2.724,-7.656c0.128,-1.298 0.128,-2.855 0.128,-4.672l0,-40.617l-17.125,0l-0,38.8c-0,1.17 -0.131,2.077 -0.131,2.855c-0.132,1.167 -0.391,2.205 -0.91,2.984c-0.26,0.65 -0.776,1.038 -1.427,1.429c-0.647,0.259 -1.295,0.388 -1.816,0.388c-0.648,-0 -1.167,-0.129 -1.689,-0.388c-0.516,-0.26 -1.035,-0.779 -1.426,-1.298c-0.388,-0.522 -0.648,-1.3 -0.779,-2.079c-0.128,-1.164 -0.259,-2.333 -0.259,-3.762c-0.129,-1.295 -0.129,-2.465 -0.129,-3.891l0,-35.038l-16.999,0Zm105.037,24.656l0,-0.91c0.131,-1.036 0,-1.943 0,-2.984c-0.128,-1.426 -0.388,-2.852 -0.907,-4.153c-0.259,-1.035 -0.779,-1.945 -1.426,-2.852c-0.391,-0.519 -1.041,-1.038 -1.689,-1.426c-0.647,-0.262 -1.426,-0.391 -2.204,-0.391c-0.648,0 -1.427,0.129 -2.08,0.391c-0.647,0.388 -1.295,0.907 -1.683,1.426c-0.653,0.907 -1.169,1.817 -1.557,2.852c-0.391,1.301 -0.65,2.727 -0.779,4.153c-0.131,0.91 -0.131,1.948 -0.131,2.984c0,0.131 0.131,0.522 0.131,0.91l12.325,-0Zm-0.647,17.647c-0.131,0.65 -0.131,1.041 -0.131,1.429c-0,0.907 -0.26,1.686 -0.517,2.464c-0.391,1.039 -0.91,1.817 -1.688,2.467c-0.907,0.648 -1.948,1.039 -3.115,0.908c-1.167,-0 -2.333,-0.391 -3.112,-1.039c-0.779,-0.519 -1.432,-1.426 -1.817,-2.336c-0.519,-1.169 -0.91,-2.464 -1.041,-3.893c-0.257,-1.426 -0.388,-2.984 -0.516,-4.41l-0,-2.727l26.988,0c0.131,-1.685 0.26,-2.852 0.26,-3.631c0.259,-3.505 0.128,-6.879 -0.26,-10.122c-0.519,-4.804 -1.817,-9.082 -3.762,-12.719c-1.686,-3.114 -4.281,-5.836 -7.655,-7.655c-2.599,-1.427 -5.711,-2.074 -8.825,-2.205c-3.115,-0 -6.099,0.647 -8.825,1.817c-2.593,1.297 -5.06,3.243 -7.137,5.838c-2.464,2.984 -4.281,6.618 -5.319,10.511c-1.167,4.153 -1.689,8.565 -1.817,13.366c-0.129,4.672 0.128,8.953 1.038,12.978c0.91,3.891 2.595,7.653 5.191,11.03c2.076,2.593 4.672,4.669 7.656,6.095c2.855,1.17 6.098,1.82 9.472,1.82c3.505,-0.131 6.877,-0.91 9.735,-2.336c2.721,-1.558 5.057,-3.894 6.486,-6.749c1.038,-2.207 1.945,-4.803 2.465,-7.655c0.259,-0.91 0.39,-1.948 0.65,-3.246l-14.404,-0Zm48.74,-42.303l0,61.119l17.126,0l-0,-38.668c-0,-0.648 0.131,-1.558 0.262,-2.336c0.128,-0.779 0.388,-1.426 0.647,-2.074c0.388,-0.522 0.91,-1.041 1.558,-1.432c0.647,-0.388 1.295,-0.647 2.074,-0.647c0.909,-0 1.557,0.259 2.079,0.647c0.519,0.391 1.035,0.91 1.297,1.558c0.26,0.522 0.388,1.169 0.517,1.817c-0,0.778 0.131,1.557 0.131,2.336c0.128,1.557 0.128,2.858 0.128,3.893l0,34.906l17.129,0l-0,-40.873c-0,-2.858 -0.126,-5.582 -0.257,-8.177c-0.131,-2.984 -0.648,-5.448 -1.558,-7.525c-0.909,-1.948 -2.464,-3.505 -4.543,-4.544c-1.558,-0.778 -3.243,-1.166 -5.06,-1.166c-1.817,-0 -3.763,0.388 -5.448,1.166c-1.817,0.779 -3.506,1.948 -4.932,3.375c-1.041,1.038 -1.948,2.336 -2.727,3.634c-0.388,0.778 -0.907,1.557 -1.297,2.595l-0,-9.604l-17.126,0Zm-1312.57,24.656l-0,-0.91c0.131,-1.036 -0,-1.943 -0,-2.984c-0.129,-1.426 -0.388,-2.852 -0.907,-4.153c-0.26,-1.035 -0.779,-1.945 -1.429,-2.852c-0.388,-0.519 -1.038,-1.038 -1.686,-1.426c-0.648,-0.262 -1.426,-0.391 -2.205,-0.391c-0.65,0 -1.429,0.129 -2.076,0.391c-0.651,0.388 -1.298,0.907 -1.686,1.426c-0.65,0.907 -1.17,1.817 -1.558,2.852c-0.39,1.301 -0.65,2.727 -0.778,4.153c-0.131,0.91 -0.131,1.948 -0.131,2.984c-0,0.131 0.131,0.522 0.131,0.91l12.325,-0Zm-0.648,17.647c-0.131,0.65 -0.131,1.041 -0.131,1.429c0,0.907 -0.259,1.686 -0.516,2.464c-0.391,1.039 -0.91,1.817 -1.689,2.467c-0.907,0.648 -1.948,1.039 -3.114,0.908c-1.17,-0 -2.334,-0.391 -3.112,-1.039c-0.779,-0.519 -1.429,-1.426 -1.82,-2.336c-0.517,-1.169 -0.907,-2.464 -1.038,-3.893c-0.257,-1.426 -0.388,-2.984 -0.519,-4.41l-0,-2.727l26.991,0c0.131,-1.685 0.262,-2.852 0.262,-3.631c0.257,-3.505 0.129,-6.879 -0.262,-10.122c-0.517,-4.804 -1.817,-9.082 -3.762,-12.719c-1.686,-3.114 -4.284,-5.836 -7.659,-7.655c-2.593,-1.427 -5.707,-2.074 -8.819,-2.205c-3.118,-0 -6.101,0.647 -8.825,1.817c-2.596,1.297 -5.063,3.243 -7.137,5.838c-2.467,2.984 -4.284,6.618 -5.322,10.511c-1.167,4.153 -1.686,8.565 -1.814,13.366c-0.131,4.672 0.128,8.953 1.035,12.978c0.908,3.891 2.596,7.653 5.192,11.03c2.076,2.593 4.672,4.669 7.655,6.095c2.855,1.17 6.098,1.82 9.473,1.82c3.505,-0.131 6.879,-0.91 9.732,-2.336c2.726,-1.558 5.062,-3.894 6.489,-6.749c1.035,-2.207 1.945,-4.803 2.467,-7.655c0.257,-0.91 0.388,-1.948 0.647,-3.246l-14.404,-0Zm63.734,-60.338c0.128,-5.97 -4.541,-10.77 -10.509,-10.898c-5.972,-0.263 -11.029,4.669 -11.029,10.767c-0,6.101 4.8,10.902 10.767,10.902c5.967,-0 10.771,-4.801 10.771,-10.771m-19.593,79.154l17.125,0l0,-61.119l-17.125,0l-0,61.119Zm47.745,-61.119l0,61.119l17.128,0l0,-38.668c0,-0.648 0.131,-1.558 0.26,-2.336c0.131,-0.779 0.388,-1.426 0.65,-2.074c0.391,-0.522 0.907,-1.041 1.557,-1.432c0.648,-0.388 1.295,-0.647 2.077,-0.647c0.907,-0 1.557,0.259 2.076,0.647c0.517,0.391 1.038,0.91 1.295,1.558c0.26,0.522 0.391,1.169 0.522,1.817c0,0.778 0.126,1.557 0.126,2.336c0.131,1.557 0.131,2.858 0.131,3.893l0,34.906l17.131,0l-0,-40.873c-0,-2.858 -0.131,-5.582 -0.26,-8.177c-0.131,-2.984 -0.65,-5.448 -1.557,-7.525c-0.91,-1.948 -2.467,-3.505 -4.541,-4.544c-1.557,-0.778 -3.246,-1.166 -5.063,-1.166c-1.817,-0 -3.762,0.388 -5.45,1.166c-1.817,0.779 -3.503,1.948 -4.932,3.375c-1.038,1.038 -1.943,2.336 -2.721,3.634c-0.391,0.778 -0.91,1.557 -1.301,2.595l0,-9.604l-17.128,0Zm69.109,0l0,14.145l6.358,-0l-0,46.974l17,0l-0,-46.974l7.915,-0l-0,-14.145l-7.915,0l-0,-12.324c-0,-1.429 0.128,-2.856 0.257,-4.153c-0,-0.779 0.262,-1.558 0.521,-2.208c0.257,-0.516 0.648,-1.038 1.298,-1.426c0.385,-0.26 0.776,-0.519 1.295,-0.648c0.391,-0.131 0.779,-0.131 1.301,-0.259c0.516,-0 0.904,0.128 1.295,0.259c0.262,0 0.65,0.129 1.038,0.388c0.26,0 0.519,0.131 0.91,0.26l-0,-16.352c-1.038,-0.257 -1.817,-0.517 -2.339,-0.648c-1.557,-0.519 -3.115,-0.779 -4.669,-0.779c-1.558,0 -3.374,0.132 -5.191,0.522c-1.948,0.517 -3.763,1.167 -5.448,2.074c-2.336,1.298 -4.284,3.374 -5.451,5.71c-1.038,1.946 -1.686,4.151 -1.817,6.489c-0,1.167 -0.131,2.724 -0,4.541l-0,18.554l-6.358,0Zm84.26,30.366c-0,-1.557 -0.131,-3.893 -0.388,-6.877c-0.26,-1.948 -0.648,-3.765 -1.169,-5.322c-0.257,-0.648 -0.648,-1.426 -1.036,-2.205c-0.391,-0.519 -0.91,-1.038 -1.432,-1.426c-0.516,-0.263 -1.164,-0.519 -1.814,-0.519c-0.65,-0 -1.298,0.128 -1.817,0.388c-0.519,0.39 -1.038,0.778 -1.426,1.3c-0.647,0.904 -1.169,1.814 -1.426,2.852c-0.653,1.689 -1.041,3.634 -1.301,5.711c-0.256,1.945 -0.256,4.022 -0.256,6.098c-0.132,2.336 -0,4.284 0.256,6.098c0.26,2.077 0.648,4.022 1.301,5.839c0.257,0.91 0.779,1.819 1.426,2.724c0.257,0.522 0.779,0.91 1.426,1.3c0.519,0.26 1.167,0.388 1.817,0.388c0.65,0 1.298,-0.128 1.814,-0.519c0.522,-0.388 1.041,-0.907 1.432,-1.426c0.388,-0.779 0.779,-1.426 1.036,-2.205c0.521,-1.557 0.909,-3.374 1.169,-5.322c0.257,-2.984 0.388,-5.32 0.388,-6.877m-1.167,-30.366l0,7.528c-0.647,-1.17 -1.169,-2.205 -1.557,-2.856c-0.648,-1.035 -1.557,-1.945 -2.596,-2.983c-1.038,-0.91 -2.076,-1.557 -3.114,-2.077c-1.295,-0.519 -2.853,-0.778 -4.413,-0.778c-1.686,-0 -3.371,0.388 -4.929,1.166c-2.595,1.17 -4.803,3.115 -6.229,5.711c-1.557,2.595 -2.727,5.579 -3.505,8.825c-1.039,5.06 -1.555,10.51 -1.555,15.961c-0,5.189 0.516,10.251 1.555,15.052c0.65,3.502 2.076,6.877 3.893,9.989c1.557,2.467 3.762,4.415 6.489,5.71c1.298,0.65 2.852,0.91 4.541,1.041c1.557,-0 3.114,-0.391 4.541,-0.91c1.169,-0.391 2.207,-1.169 3.117,-2.076c1.036,-0.908 1.945,-2.077 2.724,-3.244c0.26,-0.521 0.648,-1.169 1.038,-1.816l0,6.876l17.128,0l0,-61.119l-17.128,0Zm77.932,0.522c-1.301,-0.522 -2.208,-0.778 -2.858,-1.041c-2.074,-0.516 -4.541,-0.776 -7.265,-0.647c-2.986,0.131 -5.71,0.778 -7.915,1.817c-2.855,1.297 -5.323,3.502 -7.396,6.358c-2.336,3.374 -4.025,7.008 -5.063,11.032c-1.036,4.15 -1.557,8.563 -1.557,12.973c-0.129,5.062 0.65,9.863 1.948,14.404c1.297,4.024 3.374,7.786 6.229,10.898c2.205,2.467 4.932,4.153 7.784,5.063c1.817,0.519 4.025,0.91 6.358,0.91c2.336,-0 4.541,-0.391 6.489,-0.91c0.778,-0.26 1.817,-0.519 3.246,-1.169l-0,-15.571c-0.391,0.262 -0.779,0.519 -1.041,0.65c-0.517,0.26 -1.039,0.519 -1.686,0.779c-0.648,0.128 -1.557,0.259 -2.467,0.259c-1.558,0.129 -3.112,-0.259 -4.279,-0.909c-1.041,-0.648 -1.948,-1.558 -2.727,-2.727c-0.909,-1.555 -1.688,-3.5 -2.076,-5.708c-0.519,-2.076 -0.779,-4.281 -0.779,-6.486c0,-1.557 0.131,-3.246 0.26,-4.803c0.259,-2.074 0.778,-4.022 1.429,-5.71c0.647,-1.558 1.557,-2.853 2.593,-4.022c0.778,-0.91 1.948,-1.557 3.114,-1.945c1.039,-0.391 2.208,-0.522 3.375,-0.391c0.778,-0 1.426,0.131 1.948,0.391c0.516,0.256 1.166,0.519 1.685,0.907c0.129,0.128 0.388,0.39 0.651,0.65l-0,-15.052Zm27.893,-36.985l-0,97.582l17.128,0l-0,-38.668c-0,-0.648 0.128,-1.558 0.259,-2.336c0.129,-0.779 0.388,-1.426 0.648,-2.074c0.388,-0.522 0.91,-1.041 1.557,-1.432c0.648,-0.388 1.298,-0.647 2.077,-0.647c0.907,-0 1.557,0.259 2.076,0.647c0.519,0.391 1.036,0.91 1.298,1.558c0.259,0.522 0.388,1.169 0.516,1.817c0,0.778 0.131,1.557 0.131,2.336c0.132,1.557 0.132,2.858 0.132,3.893l-0,34.906l17.125,0l-0,-40.873c-0,-2.858 -0.126,-5.582 -0.257,-8.177c-0.131,-2.984 -0.648,-5.448 -1.557,-7.525c-0.907,-1.948 -2.465,-3.505 -4.544,-4.544c-1.557,-0.778 -3.243,-1.166 -5.057,-1.166c-1.82,-0 -3.762,0.388 -5.451,1.166c-1.817,0.779 -3.505,1.948 -4.932,3.375c-1.038,1.038 -1.948,2.336 -2.726,3.634c-0.388,0.778 -0.907,1.557 -1.295,2.595l-0,-46.067l-17.128,-0Zm124.405,66.829c0,1.557 0.131,3.893 0.516,6.877c0.263,2.076 0.52,3.765 1.041,5.322c0.26,0.648 0.648,1.426 1.167,2.205c0.391,0.519 0.779,1.038 1.298,1.426c0.65,0.391 1.167,0.519 1.814,0.519c0.653,0.129 1.301,-0.128 1.82,-0.388c0.647,-0.39 1.169,-0.778 1.557,-1.3c0.648,-0.779 1.038,-1.814 1.426,-2.724c0.65,-1.817 1.038,-3.762 1.298,-5.839c0.131,-1.945 0.26,-4.024 0.26,-6.098c-0,-2.205 -0.129,-4.284 -0.26,-6.098c-0.26,-2.077 -0.648,-4.022 -1.298,-5.711c-0.388,-1.038 -0.778,-1.948 -1.426,-2.852c-0.388,-0.522 -0.91,-0.91 -1.557,-1.3c-0.519,-0.26 -1.167,-0.388 -1.82,-0.388c-0.647,-0 -1.295,0.256 -1.814,0.519c-0.391,0.388 -0.907,0.907 -1.298,1.426c-0.519,0.779 -0.907,1.426 -1.167,2.205c-0.521,1.557 -0.778,3.374 -1.041,5.322c-0.385,3.115 -0.516,5.32 -0.516,6.877m1.295,-66.829l-17.125,-0l-0,97.582l17.125,0l0,-6.876c0.391,0.778 0.779,1.426 1.041,1.816c0.648,1.167 1.557,2.336 2.596,3.244c0.904,0.907 2.073,1.685 3.114,2.076c1.427,0.519 2.984,0.91 4.67,0.91c1.557,-0.131 3.114,-0.391 4.541,-1.041c2.595,-1.169 4.803,-3.112 6.36,-5.71c1.817,-2.984 3.243,-6.358 4.022,-9.989c1.038,-4.801 1.557,-9.863 1.557,-15.052c0,-5.451 -0.519,-10.901 -1.688,-15.961c-0.648,-3.246 -1.817,-6.23 -3.375,-8.825c-1.426,-2.465 -3.631,-4.41 -6.226,-5.711c-1.558,-0.778 -3.246,-1.166 -5.06,-1.166c-1.558,-0 -2.986,0.259 -4.284,0.778c-1.038,0.52 -2.205,1.167 -3.243,2.077c-1.039,1.038 -1.946,1.948 -2.596,2.983c-0.388,0.651 -0.907,1.686 -1.429,2.856l0,-43.991Zm83.77,61.119l0,-0.91c0.129,-1.036 0,-1.943 0,-2.984c-0.131,-1.426 -0.39,-2.852 -0.91,-4.153c-0.259,-1.035 -0.778,-1.945 -1.426,-2.852c-0.39,-0.519 -1.038,-1.038 -1.688,-1.426c-0.648,-0.262 -1.427,-0.391 -2.205,-0.391c-0.648,0 -1.426,0.129 -2.077,0.391c-0.65,0.388 -1.297,0.907 -1.688,1.426c-0.648,0.907 -1.167,1.817 -1.557,2.852c-0.388,1.301 -0.648,2.727 -0.779,4.153c-0.126,0.91 -0.126,1.948 -0.126,2.984c0,0.131 0.126,0.522 0.126,0.91l12.33,-0Zm-0.65,17.647c-0.128,0.65 -0.128,1.041 -0.128,1.429c-0,0.907 -0.26,1.686 -0.522,2.464c-0.388,1.039 -0.905,1.817 -1.683,2.467c-0.91,0.648 -1.948,1.039 -3.115,0.908c-1.169,-0 -2.339,-0.391 -3.117,-1.039c-0.779,-0.519 -1.427,-1.426 -1.815,-2.336c-0.521,-1.169 -0.909,-2.464 -1.038,-3.893c-0.262,-1.426 -0.388,-2.984 -0.519,-4.41l0,-2.727l26.991,0c0.126,-1.685 0.257,-2.852 0.257,-3.631c0.26,-3.505 0.131,-6.879 -0.257,-10.122c-0.522,-4.804 -1.817,-9.082 -3.765,-12.719c-1.685,-3.114 -4.281,-5.836 -7.655,-7.655c-2.596,-1.427 -5.71,-2.074 -8.825,-2.205c-3.115,-0 -6.098,0.647 -8.825,1.817c-2.593,1.297 -5.057,3.243 -7.137,5.838c-2.464,2.984 -4.278,6.618 -5.319,10.511c-1.167,4.153 -1.686,8.565 -1.817,13.366c-0.126,4.672 0.131,8.953 1.038,12.978c0.91,3.891 2.598,7.653 5.194,11.03c2.074,2.593 4.669,4.669 7.656,6.095c2.852,1.17 6.095,1.82 9.472,1.82c3.5,-0.131 6.874,-0.91 9.732,-2.336c2.724,-1.558 5.057,-3.894 6.486,-6.749c1.039,-2.207 1.948,-4.803 2.465,-7.655c0.262,-0.91 0.39,-1.948 0.647,-3.246l-14.401,-0Zm79.564,-38.15c-0.908,-0.778 -1.686,-1.295 -2.205,-1.557c-2.079,-1.167 -4.153,-2.074 -6.358,-2.724c-2.336,-0.65 -4.932,-1.038 -7.656,-1.038c-2.726,-0 -5.322,0.388 -7.786,1.038c-2.208,0.779 -4.413,1.817 -6.361,3.374c-2.074,1.817 -3.631,3.891 -4.8,6.099c-0.908,2.207 -1.427,4.8 -1.558,7.396c0,2.464 0.391,4.8 1.17,7.005c0.647,1.948 1.688,3.765 2.983,5.322c1.301,1.558 3.246,3.115 5.451,4.413c1.426,0.907 2.986,1.685 4.669,2.595c1.17,0.648 2.21,1.295 3.115,1.817c0.91,0.519 1.557,1.298 2.079,2.077c0.26,0.516 0.388,1.166 0.516,1.942c0,1.17 -0.256,2.21 -0.907,3.115c-0.519,0.781 -1.166,1.3 -1.814,1.688c-0.653,0.26 -1.431,0.391 -2.21,0.52c-1.426,-0 -2.984,-0.26 -4.279,-0.779c-1.169,-0.519 -2.207,-1.167 -3.114,-1.946c-0.391,-0.388 -0.91,-0.778 -1.558,-1.297l-7.527,12.196c1.298,0.907 2.205,1.686 2.855,2.077c1.946,1.297 4.15,2.467 6.618,3.245c2.983,0.908 5.969,1.427 8.953,1.558c3.115,-0 6.358,-0.65 9.082,-1.948c2.207,-1.167 4.153,-2.724 5.841,-4.541c1.686,-2.205 2.984,-4.541 3.634,-7.008c0.65,-2.205 1.038,-4.67 1.038,-7.137c0,-2.076 -0.131,-4.021 -0.519,-5.71c-0.519,-1.948 -1.298,-3.762 -2.596,-5.448c-1.166,-1.688 -2.595,-2.986 -4.152,-4.153c-1.686,-1.166 -3.503,-2.207 -5.451,-3.246c-1.686,-0.778 -3.115,-1.557 -4.15,-2.336c-0.91,-0.516 -1.56,-1.166 -2.077,-1.945c-0.262,-0.519 -0.388,-1.298 -0.388,-2.076c0,-0.779 0.257,-1.689 0.776,-2.468c0.388,-0.516 0.907,-1.035 1.429,-1.295c0.648,-0.259 1.295,-0.519 2.205,-0.519c1.295,0 2.596,0.26 3.893,0.907c0.907,0.519 1.946,1.17 2.984,1.948c0.391,0.391 0.907,0.779 1.429,1.295l6.746,-12.456Zm62.713,0c-0.907,-0.778 -1.685,-1.295 -2.207,-1.557c-2.074,-1.167 -4.15,-2.074 -6.358,-2.724c-2.336,-0.65 -4.929,-1.038 -7.656,-1.038c-2.726,-0 -5.319,0.388 -7.784,1.038c-2.205,0.779 -4.415,1.817 -6.357,3.374c-2.077,1.817 -3.637,3.891 -4.804,6.099c-0.907,2.207 -1.426,4.8 -1.557,7.396c0,2.464 0.388,4.8 1.167,7.005c0.653,1.948 1.688,3.765 2.986,5.322c1.298,1.558 3.246,3.115 5.451,4.413c1.426,0.907 2.983,1.685 4.672,2.595c1.166,0.648 2.205,1.295 3.112,1.817c0.91,0.519 1.557,1.298 2.076,2.077c0.26,0.516 0.391,1.166 0.522,1.942c-0,1.17 -0.262,2.21 -0.91,3.115c-0.522,0.781 -1.169,1.3 -1.817,1.688c-0.65,0.26 -1.429,0.391 -2.205,0.52c-1.429,-0 -2.986,-0.26 -4.284,-0.779c-1.166,-0.519 -2.205,-1.167 -3.114,-1.946c-0.388,-0.388 -0.91,-0.778 -1.558,-1.297l-7.524,12.196c1.298,0.907 2.205,1.686 2.855,2.077c1.945,1.297 4.153,2.467 6.617,3.245c2.984,0.908 5.967,1.427 8.951,1.558c3.117,-0 6.361,-0.65 9.085,-1.948c2.207,-1.167 4.152,-2.724 5.841,-4.541c1.686,-2.205 2.983,-4.541 3.631,-7.008c0.65,-2.205 1.041,-4.67 1.041,-7.137c-0,-2.076 -0.131,-4.021 -0.522,-5.71c-0.519,-1.948 -1.298,-3.762 -2.593,-5.448c-1.169,-1.688 -2.595,-2.986 -4.153,-4.153c-1.688,-1.166 -3.505,-2.207 -5.45,-3.246c-1.686,-0.778 -3.112,-1.557 -4.153,-2.336c-0.907,-0.516 -1.558,-1.166 -2.074,-1.945c-0.262,-0.519 -0.391,-1.298 -0.391,-2.076c0,-0.779 0.26,-1.689 0.779,-2.468c0.391,-0.516 0.907,-1.035 1.426,-1.295c0.65,-0.259 1.301,-0.519 2.208,-0.519c1.298,0 2.593,0.26 3.893,0.907c0.907,0.519 1.945,1.17 2.984,1.948c0.388,0.391 0.909,0.779 1.426,1.295l6.748,-12.456Zm54.411,20.503l0,-0.91c0.126,-1.036 0,-1.943 0,-2.984c-0.131,-1.426 -0.391,-2.852 -0.91,-4.153c-0.259,-1.035 -0.778,-1.945 -1.429,-2.852c-0.388,-0.519 -1.035,-1.038 -1.685,-1.426c-0.651,-0.262 -1.429,-0.391 -2.208,-0.391c-0.648,0 -1.426,0.129 -2.074,0.391c-0.65,0.388 -1.298,0.907 -1.688,1.426c-0.648,0.907 -1.167,1.817 -1.558,2.852c-0.388,1.301 -0.647,2.727 -0.778,4.153c-0.129,0.91 -0.129,1.948 -0.129,2.984c0,0.131 0.129,0.522 0.129,0.91l12.33,-0Zm-0.65,17.647c-0.129,0.65 -0.129,1.041 -0.129,1.429c0,0.907 -0.259,1.686 -0.521,2.464c-0.388,1.039 -0.908,1.817 -1.686,2.467c-0.91,0.648 -1.946,1.039 -3.115,0.908c-1.167,-0 -2.336,-0.391 -3.115,-1.039c-0.778,-0.519 -1.426,-1.426 -1.816,-2.336c-0.52,-1.169 -0.908,-2.464 -1.036,-3.893c-0.262,-1.426 -0.391,-2.984 -0.522,-4.41l0,-2.727l26.991,0c0.129,-1.685 0.26,-2.852 0.26,-3.631c0.26,-3.505 0.131,-6.879 -0.26,-10.122c-0.519,-4.804 -1.814,-9.082 -3.762,-12.719c-1.688,-3.114 -4.281,-5.836 -7.655,-7.655c-2.596,-1.427 -5.711,-2.074 -8.825,-2.205c-3.115,-0 -6.099,0.647 -8.823,1.817c-2.598,1.297 -5.062,3.243 -7.139,5.838c-2.464,2.984 -4.281,6.618 -5.319,10.511c-1.167,4.153 -1.686,8.565 -1.817,13.366c-0.129,4.672 0.131,8.953 1.038,12.978c0.91,3.891 2.596,7.653 5.191,11.03c2.077,2.593 4.669,4.669 7.658,6.095c2.853,1.17 6.096,1.82 9.473,1.82c3.5,-0.131 6.874,-0.91 9.729,-2.336c2.727,-1.558 5.06,-3.894 6.489,-6.749c1.038,-2.207 1.948,-4.803 2.465,-7.655c0.262,-0.91 0.39,-1.948 0.65,-3.246l-14.404,-0Zm44.138,-42.303l-0,61.119l17,0l-0,-31.922c-0,-1.558 -0,-3.115 0.128,-4.541c-0,-1.817 0.262,-3.375 0.779,-4.672c0.519,-1.427 1.557,-2.722 3.114,-3.763c0.91,-0.647 2.077,-1.169 3.375,-1.557c1.038,-0.259 2.076,-0.519 3.245,-0.519l2.074,-0c0.388,-0 0.779,0.128 1.429,0.26l0,-16.609c-0.65,0.131 -1.167,0.131 -1.688,0.259c-2.468,0.388 -4.672,1.426 -6.618,2.855c-1.686,1.298 -3.243,2.984 -4.669,4.932c-0.391,0.516 -0.779,1.038 -1.169,1.557l-0,-7.399l-17,0Zm-295.004,-148.423l89.089,-0l0,25.452l-89.089,0l-0,-25.452Zm101.821,-152.73c35.107,0 63.634,28.525 63.634,63.637l0,178.182l-178.179,0c-35.115,0 -63.639,-28.524 -63.639,-63.637l-0,-89.089l165.452,-0l0,-25.456l-165.452,0l-0,-63.637l178.184,0Zm549.247,0l0,63.637l-80.682,0l-0,178.182l-76.366,0l-0,-178.182c-0,-35.112 28.527,-63.637 63.64,-63.637l93.408,0Zm-1002.17,0l50.547,0l-50.547,0Zm-114.726,0l280,0c35.113,0 63.634,28.525 63.634,63.637l0,178.182l-76.363,0l0,-178.182l-89.09,0l0,178.182l-76.363,0l0,-178.182l-89.089,0l-0,178.182l-76.366,0l-0,-178.182c-0,-35.112 28.524,-63.637 63.637,-63.637Zm839.485,369.693l-0,-127.874l-101.816,0c-35.113,0 -63.635,-28.524 -63.635,-63.637l0,-178.182l76.361,0l0,178.182l89.09,0l-0,-178.182l76.366,0l-0.431,241.819l-0,38.888l-0.048,25.349c-0.062,35.131 -28.621,63.637 -63.752,63.637l-12.135,-0Z" style="color: currentColor"/>
            <path d="M462.407,54.166l83.01,-0l0,29.643l-77.08,-0l-0,11.859l77.08,0l0,41.505c0,16.358 -13.288,29.646 -29.645,29.646l-83.01,-0l-0,-29.646l77.08,0l0,-11.859l-77.08,-0l-0,-41.503c-0,-16.357 13.288,-29.645 29.645,-29.645m-169.822,29.645c-0,-16.357 13.288,-29.645 29.645,-29.645l53.362,-0c16.358,-0 29.646,13.288 29.646,29.645l-0,83.008l-35.576,-0l0,-83.01l-41.502,-0l0,83.01l-35.575,-0l-0,-83.008Zm-88.814,0c-0,-16.357 13.288,-29.645 29.645,-29.645l47.435,-0l0,29.643l-41.505,-0l0,83.01l-35.575,-0l-0,-83.008Zm-61.135,11.857l-41.505,0l-0,-11.859l41.505,-0l-0,11.859Zm-47.432,71.151c-16.361,-0 -29.649,-13.288 -29.649,-29.646l0,-53.362c0,-16.357 13.288,-29.645 29.649,-29.645l53.361,-0c16.355,-0 29.646,13.288 29.646,29.645l0,41.503l-77.08,-0l-0,11.859l77.08,0l0,29.646l-83.007,-0Zm-78.852,23.719l-0,-162.192l555.385,0l0,138.473l35.575,-0l0,-83.01l41.503,-0l-0,-29.643l-41.503,-0l0,-25.82l793.659,0l0,439.211l-162.194,0l0,-277.019l-1222.42,-0Z" style="color: currentColor"/>
        </g>
    </g>
</svg>
