<svg xmlns="http://www.w3.org/2000/svg"
     viewBox="0 0 512 512"><!--! Font Awesome Pro 6.4.0 by @fontawesome - https://fontawesome.com License - https://fontawesome.com/license (Commercial License) Copyright 2023 Fonticons, Inc. -->
  <path
    d="M208 0c-26.8 0-51.1 11-68.5 28.8l-.1 0C126.9 20.7 112 16 96 16C51.8 16 16 51.8 16 96s35.8 80 80 80c16 0 30.9-4.7 43.4-12.8l.1 0C156.9 181 181.2 192 208 192c26.5 0 50.6-10.8 68-28.2l0 0c12.8 8.5 28.2 13.5 44.6 13.5c44.5 0 80.6-36.1 80.6-80.6s-36.1-80.6-80.6-80.6c-16.1 0-31.2 4.8-43.9 13l0 0C259.3 11.1 234.9 0 208 0zM173.1 63c8.8-9.3 21.1-15 34.9-15c13.8 0 26.2 5.8 35 15.1c8.4 8.9 19.6 12.8 29.3 13.7c9.7 .9 20.9-1 30.4-7.4c5.2-3.4 11.3-5.4 18-5.4c18 0 32.6 14.6 32.6 32.6s-14.6 32.6-32.6 32.6c-6.8 0-13.1-2.1-18.3-5.6c-9.4-6.4-20.6-8.4-30.3-7.7c-9.7 .7-20.9 4.5-29.4 13.3c-8.8 9.1-21 14.7-34.6 14.7c-13.7 0-26.1-5.7-34.9-15c-8.4-8.9-19.6-12.7-29.2-13.6c-9.7-.8-20.8 1.1-30.3 7.3c-5 3.3-11.1 5.3-17.6 5.3c-17.7 0-32-14.3-32-32s14.3-32 32-32c6.5 0 12.6 1.9 17.6 5.3c9.5 6.3 20.6 8.2 30.3 7.3c9.7-.8 20.8-4.7 29.2-13.6zM32 187.9V448c0 35.3 28.7 64 64 64H320c35.3 0 64-28.7 64-64v-.3l86.8-38c25-11 41.2-35.7 41.2-63V228.8c0-38-30.8-68.8-68.8-68.8H413.8c-17.5 25.7-45.5 43.8-77.8 48.2V431.5c0 .4 0 .7 0 1.1V448c0 8.8-7.2 16-16 16H96c-8.8 0-16-7.2-16-16V206.9c-17.7-2.5-34-9.2-48-18.9zM208 224c-8.8 0-16 7.2-16 16V400c0 8.8 7.2 16 16 16s16-7.2 16-16V240c0-8.8-7.2-16-16-16zM320.3 97.2c.1 0 .1 .1 .1 .1l0 0c0 0 .1 0 .2 0c.1 0 .2 0 .2 0l0 0c0 0 .1-.1 .2-.2s.1-.2 .2-.2l0 0c0 0 0-.1 0-.2s0-.2 0-.2l0 0c0 0-.1-.1-.2-.2s-.2-.1-.2-.2l0 0c0 0-.1 0-.2 0c-.1 0-.1 0-.2 0l0 0s0 0 0 0s0 0-.1 0l-.9 .6 .8 .6zM96 96l0 0 0 0 0 0s0 0 0 0s0 0 0 0l0 0 0 0 0 0 0 0 0 0zM443.2 208c11.5 0 20.8 9.3 20.8 20.8V346.7c0 8.3-4.9 15.7-12.5 19.1L384 395.3V208h59.2zM160 240c0-8.8-7.2-16-16-16s-16 7.2-16 16V400c0 8.8 7.2 16 16 16s16-7.2 16-16V240zm128 0c0-8.8-7.2-16-16-16s-16 7.2-16 16V400c0 8.8 7.2 16 16 16s16-7.2 16-16V240z"/>
</svg>
