@startuml BlogOntology
'===title:===
title Онтология Блога

'===include section:===


'===styles:===
skinparam backgroundColor #AABBCC

' skinparam handwritten true
'===settings of the diagram:===
left to right direction

'===diagram section:==================================================================================================
!$Tags   = "Тэги"
!$Author = "Автор"
!$Title  = "Название"
!$Body   = "Текст"

!$Rubricator = "Рубрикатор"
!$Category   = "Категория"
!$Article    = "Статья"
!$Comment    = "Комментарий"

!$User   = "Пользователь"

!$Reader = "Читатель"
!$Writer = "Писатель"

!$Admin  = "Администратор"

!$Contains  = "Содержит"
!$Use       = "Использует"
!$Is        = "Является"
!$Edit      = "Редактирует"
!$Belongs   = "Принадлежит"

!$Check     = "Проверяет"
!$Public    = "Публикует"
!$Delete    = "Удаляет"
!$Send     = "Отправляет"

'($User)  --> ($Admin):  $Is
'($User)  --> ($Reader): $Is
'($User)  --> ($Writer): $Is

($Admin)  --> ($Rubricator): $Edit
($Admin)  --> ($Category):   $Edit
($Admin)  --> ($Article):    $Check
($Admin)  --> ($Article):    $Public
($Admin)  --> ($Article):    $Delete

($Article) --> ($Body)    : $Contains
($Article) --> ($Title)   : $Contains
($Article) --> ($Tags)    : $Contains
($Article) --> ($Comment) : $Contains
($Article) -- [Автор\nВремя создания\n]

($Body)    <-- ($Writer) : $Edit
($Title)   <-- ($Writer) : $Edit
($Tags)    <-- ($Writer) : $Edit
'($Comment) <-- ($Writer) : $Edit
($Article) <-- ($Writer) : $Delete
($Article) <-- ($Writer) : $Send
($Article) --> ($Writer) : $Belongs

($Rubricator)  -right-> ($Category) : $Contains
($Category)    -right-> ($Article)  : $Contains
@enduml