{
  "worktodos": [
    {
      "id": 1,
      "title": "Read SitePoint article",
      "complete": false
    },
    {
      "id": 2,
      "title": "Clean inbox",
      "complete": false
    },
    {
      "id": 3,
      "title": "Make restaurant reservation",
      "complete": false
    },
    {
      "id": 4,
      "title": "Java",
      "complete": true
    }
  ]
}