
"Algorithmusname","Modellvergroesserung","Versuchsnummer","Genutzte Zeit","Erkannte PCP Instanzcen","Angewendete Adaptionen","WorkingFunctions","Kosten"
"BestFirstSearch","0","0","0.9293749","Risk: ""UnauthorizedAccess"" | Risk: ""OutsideEU"" | ","OutsideEU: Adaptation_1_3 | UnauthorizedAccess: Adaptation_2_3 | ","3","2.7792"
"DepthSearch","0","0","0.7807446","Risk: ""UnauthorizedAccess"" | Risk: ""OutsideEU"" | ","UnauthorizedAccess: Adaptation_2_3 | OutsideEU: Adaptation_1_3 | ","3","2.7792"
"BreadthSearch","0","0","0.5568477","Risk: ""UnauthorizedAccess"" | Risk: ""OutsideEU"" | ","OutsideEU: Adaptation_1_3 | UnauthorizedAccess: Adaptation_2_3 | ","3","2.7792"
"RandomSearch","0","0","0.5528755","Risk: ""UnauthorizedAccess"" | Risk: ""OutsideEU"" | ","OutsideEU: Adaptation_1_3 | UnauthorizedAccess: Adaptation_2_3 | ","3","2.7792"
"BestFirstSearch","0","1","0.5760036","Risk: ""UnauthorizedAccess"" | Risk: ""OutsideEU"" | ","OutsideEU: Adaptation_1_3 | UnauthorizedAccess: Adaptation_2_3 | ","3","2.7792"
"DepthSearch","0","1","0.4691307","Risk: ""UnauthorizedAccess"" | Risk: ""OutsideEU"" | ","UnauthorizedAccess: Adaptation_2_3 | OutsideEU: Adaptation_1_3 | ","3","2.7792"
"BreadthSearch","0","1","0.3283895","Risk: ""UnauthorizedAccess"" | Risk: ""OutsideEU"" | ","OutsideEU: Adaptation_1_3 | UnauthorizedAccess: Adaptation_2_3 | ","3","2.7792"
"RandomSearch","0","1","0.2712951","Risk: ""UnauthorizedAccess"" | Risk: ""OutsideEU"" | ","OutsideEU: Adaptation_1_3 | UnauthorizedAccess: Adaptation_2_3 | ","3","2.7792"
"BestFirstSearch","0","2","0.4147779","Risk: ""UnauthorizedAccess"" | Risk: ""OutsideEU"" | ","OutsideEU: Adaptation_1_3 | UnauthorizedAccess: Adaptation_2_3 | ","3","2.7792"
"DepthSearch","0","2","0.3251947","Risk: ""UnauthorizedAccess"" | Risk: ""OutsideEU"" | ","UnauthorizedAccess: Adaptation_2_3 | OutsideEU: Adaptation_1_3 | ","3","2.7792"
"BreadthSearch","0","2","0.2347703","Risk: ""UnauthorizedAccess"" | Risk: ""OutsideEU"" | ","OutsideEU: Adaptation_1_3 | UnauthorizedAccess: Adaptation_2_3 | ","3","2.7792"
"RandomSearch","0","2","0.2805241","Risk: ""UnauthorizedAccess"" | Risk: ""OutsideEU"" | ","OutsideEU: Adaptation_1_3 | UnauthorizedAccess: Adaptation_2_3 | ","3","2.7792"
"BestFirstSearch","0","3","0.5218102","Risk: ""UnauthorizedAccess"" | Risk: ""OutsideEU"" | ","OutsideEU: Adaptation_1_3 | UnauthorizedAccess: Adaptation_2_3 | ","3","2.7792"
"DepthSearch","0","3","0.4350343","Risk: ""UnauthorizedAccess"" | Risk: ""OutsideEU"" | ","UnauthorizedAccess: Adaptation_2_3 | OutsideEU: Adaptation_1_3 | ","3","2.7792"
"BreadthSearch","0","3","0.3700818","Risk: ""UnauthorizedAccess"" | Risk: ""OutsideEU"" | ","OutsideEU: Adaptation_1_3 | UnauthorizedAccess: Adaptation_2_3 | ","3","2.7792"
"RandomSearch","0","3","0.3714991","Risk: ""UnauthorizedAccess"" | Risk: ""OutsideEU"" | ","OutsideEU: Adaptation_1_3 | UnauthorizedAccess: Adaptation_2_3 | ","3","2.7792"
"BestFirstSearch","0","4","0.2212991","Risk: ""UnauthorizedAccess"" | Risk: ""OutsideEU"" | ","OutsideEU: Adaptation_1_3 | UnauthorizedAccess: Adaptation_2_3 | ","3","2.7792"
"DepthSearch","0","4","0.4397546","Risk: ""UnauthorizedAccess"" | Risk: ""OutsideEU"" | ","UnauthorizedAccess: Adaptation_2_3 | OutsideEU: Adaptation_1_3 | ","3","2.7792"
"BreadthSearch","0","4","0.2962656","Risk: ""UnauthorizedAccess"" | Risk: ""OutsideEU"" | ","OutsideEU: Adaptation_1_3 | UnauthorizedAccess: Adaptation_2_3 | ","3","2.7792"
"RandomSearch","0","4","0.3423849","Risk: ""UnauthorizedAccess"" | Risk: ""OutsideEU"" | ","UnauthorizedAccess: Adaptation_2_3 | OutsideEU: Adaptation_1_3 | ","3","2.7792"
"BestFirstSearch","0","5","0.2944686","Risk: ""UnauthorizedAccess"" | Risk: ""OutsideEU"" | ","OutsideEU: Adaptation_1_3 | UnauthorizedAccess: Adaptation_2_3 | ","3","2.7792"
"DepthSearch","0","5","0.277221","Risk: ""UnauthorizedAccess"" | Risk: ""OutsideEU"" | ","UnauthorizedAccess: Adaptation_2_3 | OutsideEU: Adaptation_1_3 | ","3","2.7792"
"BreadthSearch","0","5","0.243762","Risk: ""UnauthorizedAccess"" | Risk: ""OutsideEU"" | ","OutsideEU: Adaptation_1_3 | UnauthorizedAccess: Adaptation_2_3 | ","3","2.7792"
"RandomSearch","0","5","0.2395888","Risk: ""UnauthorizedAccess"" | Risk: ""OutsideEU"" | ","OutsideEU: Adaptation_1_3 | UnauthorizedAccess: Adaptation_2_3 | ","3","2.7792"
"BestFirstSearch","0","6","0.2726321","Risk: ""UnauthorizedAccess"" | Risk: ""OutsideEU"" | ","OutsideEU: Adaptation_1_3 | UnauthorizedAccess: Adaptation_2_3 | ","3","2.7792"
"DepthSearch","0","6","0.2037005","Risk: ""UnauthorizedAccess"" | Risk: ""OutsideEU"" | ","UnauthorizedAccess: Adaptation_2_3 | OutsideEU: Adaptation_1_3 | ","3","2.7792"
"BreadthSearch","0","6","0.2567672","Risk: ""UnauthorizedAccess"" | Risk: ""OutsideEU"" | ","OutsideEU: Adaptation_1_3 | UnauthorizedAccess: Adaptation_2_3 | ","3","2.7792"
"RandomSearch","0","6","0.2091351","Risk: ""UnauthorizedAccess"" | Risk: ""OutsideEU"" | ","OutsideEU: Adaptation_1_3 | UnauthorizedAccess: Adaptation_2_3 | ","3","2.7792"
"BestFirstSearch","0","7","0.2616871","Risk: ""UnauthorizedAccess"" | Risk: ""OutsideEU"" | ","OutsideEU: Adaptation_1_3 | UnauthorizedAccess: Adaptation_2_3 | ","3","2.7792"
"DepthSearch","0","7","0.2031031","Risk: ""UnauthorizedAccess"" | Risk: ""OutsideEU"" | ","UnauthorizedAccess: Adaptation_2_3 | OutsideEU: Adaptation_1_3 | ","3","2.7792"
"BreadthSearch","0","7","0.2178082","Risk: ""UnauthorizedAccess"" | Risk: ""OutsideEU"" | ","OutsideEU: Adaptation_1_3 | UnauthorizedAccess: Adaptation_2_3 | ","3","2.7792"
"RandomSearch","0","7","0.2084559","Risk: ""UnauthorizedAccess"" | Risk: ""OutsideEU"" | ","UnauthorizedAccess: Adaptation_2_3 | OutsideEU: Adaptation_1_3 | ","3","2.7792"
"BestFirstSearch","0","8","0.2113651","Risk: ""UnauthorizedAccess"" | Risk: ""OutsideEU"" | ","OutsideEU: Adaptation_1_3 | UnauthorizedAccess: Adaptation_2_3 | ","3","2.7792"
"DepthSearch","0","8","0.2742982","Risk: ""UnauthorizedAccess"" | Risk: ""OutsideEU"" | ","UnauthorizedAccess: Adaptation_2_3 | OutsideEU: Adaptation_1_3 | ","3","2.7792"
"BreadthSearch","0","8","0.2319197","Risk: ""UnauthorizedAccess"" | Risk: ""OutsideEU"" | ","OutsideEU: Adaptation_1_3 | UnauthorizedAccess: Adaptation_2_3 | ","3","2.7792"
"RandomSearch","0","8","0.2068547","Risk: ""UnauthorizedAccess"" | Risk: ""OutsideEU"" | ","OutsideEU: Adaptation_1_3 | UnauthorizedAccess: Adaptation_2_3 | ","3","2.7792"
"BestFirstSearch","0","9","0.206938","Risk: ""UnauthorizedAccess"" | Risk: ""OutsideEU"" | ","OutsideEU: Adaptation_1_3 | UnauthorizedAccess: Adaptation_2_3 | ","3","2.7792"
"DepthSearch","0","9","0.2164899","Risk: ""UnauthorizedAccess"" | Risk: ""OutsideEU"" | ","UnauthorizedAccess: Adaptation_2_3 | OutsideEU: Adaptation_1_3 | ","3","2.7792"
"BreadthSearch","0","9","0.2140498","Risk: ""UnauthorizedAccess"" | Risk: ""OutsideEU"" | ","OutsideEU: Adaptation_1_3 | UnauthorizedAccess: Adaptation_2_3 | ","3","2.7792"
"RandomSearch","0","9","0.2029917","Risk: ""UnauthorizedAccess"" | Risk: ""OutsideEU"" | ","UnauthorizedAccess: Adaptation_2_3 | OutsideEU: Adaptation_1_3 | ","3","2.7792"
"BestFirstSearch","1","0","12.0388522","Risk: ""UnauthorizedAccess"" | Risk: ""UnauthorizedAccess"" | Risk: ""OutsideEU"" | Risk: ""OutsideEU"" | ","OutsideEU: Adaptation_1_3 | OutsideEU: Adaptation_1_3 | UnauthorizedAccess: Adaptation_2_3 | UnauthorizedAccess: Adaptation_2_3 | ","5","5.006399999999999"
"DepthSearch","1","0","10.6008168","Risk: ""UnauthorizedAccess"" | Risk: ""UnauthorizedAccess"" | Risk: ""OutsideEU"" | Risk: ""OutsideEU"" | ","UnauthorizedAccess: Adaptation_2_3 | UnauthorizedAccess: Adaptation_2_2 | OutsideEU: Adaptation_1_3 | OutsideEU: Adaptation_1_3 | ","5","5.006399999999999"
"BreadthSearch","1","0","10.1358919","Risk: ""UnauthorizedAccess"" | Risk: ""UnauthorizedAccess"" | Risk: ""OutsideEU"" | Risk: ""OutsideEU"" | ","OutsideEU: Adaptation_1_3 | OutsideEU: Adaptation_1_3 | UnauthorizedAccess: Adaptation_2_3 | UnauthorizedAccess: Adaptation_2_3 | ","5","5.006399999999999"
"RandomSearch","1","0","10.8837213","Risk: ""UnauthorizedAccess"" | Risk: ""UnauthorizedAccess"" | Risk: ""OutsideEU"" | Risk: ""OutsideEU"" | ","OutsideEU: Adaptation_1_3 | OutsideEU: Adaptation_1_3 | UnauthorizedAccess: Adaptation_2_3 | UnauthorizedAccess: Adaptation_2_3 | ","5","5.006399999999999"
"BestFirstSearch","1","1","9.2708878","Risk: ""UnauthorizedAccess"" | Risk: ""UnauthorizedAccess"" | Risk: ""OutsideEU"" | Risk: ""OutsideEU"" | ","OutsideEU: Adaptation_1_3 | OutsideEU: Adaptation_1_3 | UnauthorizedAccess: Adaptation_2_3 | UnauthorizedAccess: Adaptation_2_3 | ","5","5.006399999999999"
"DepthSearch","1","1","10.089473","Risk: ""UnauthorizedAccess"" | Risk: ""UnauthorizedAccess"" | Risk: ""OutsideEU"" | Risk: ""OutsideEU"" | ","UnauthorizedAccess: Adaptation_2_3 | UnauthorizedAccess: Adaptation_2_3 | OutsideEU: Adaptation_1_3 | OutsideEU: Adaptation_1_3 | ","5","5.006399999999999"
"BreadthSearch","1","1","8.9647903","Risk: ""UnauthorizedAccess"" | Risk: ""UnauthorizedAccess"" | Risk: ""OutsideEU"" | Risk: ""OutsideEU"" | ","OutsideEU: Adaptation_1_3 | OutsideEU: Adaptation_1_3 | UnauthorizedAccess: Adaptation_2_3 | UnauthorizedAccess: Adaptation_2_3 | ","5","5.006399999999999"
"RandomSearch","1","1","9.6393293","Risk: ""UnauthorizedAccess"" | Risk: ""UnauthorizedAccess"" | Risk: ""OutsideEU"" | Risk: ""OutsideEU"" | ","UnauthorizedAccess: Adaptation_2_3 | UnauthorizedAccess: Adaptation_2_3 | OutsideEU: Adaptation_1_3 | OutsideEU: Adaptation_1_3 | ","5","5.006399999999999"
"BestFirstSearch","1","2","9.3380335","Risk: ""UnauthorizedAccess"" | Risk: ""UnauthorizedAccess"" | Risk: ""OutsideEU"" | Risk: ""OutsideEU"" | ","OutsideEU: Adaptation_1_3 | OutsideEU: Adaptation_1_3 | UnauthorizedAccess: Adaptation_2_3 | UnauthorizedAccess: Adaptation_2_3 | ","5","5.006399999999999"
"DepthSearch","1","2","9.4731786","Risk: ""UnauthorizedAccess"" | Risk: ""UnauthorizedAccess"" | Risk: ""OutsideEU"" | Risk: ""OutsideEU"" | ","UnauthorizedAccess: Adaptation_2_3 | UnauthorizedAccess: Adaptation_2_2 | OutsideEU: Adaptation_1_3 | OutsideEU: Adaptation_1_3 | ","5","5.006399999999999"
"BreadthSearch","1","2","9.5079482","Risk: ""UnauthorizedAccess"" | Risk: ""UnauthorizedAccess"" | Risk: ""OutsideEU"" | Risk: ""OutsideEU"" | ","OutsideEU: Adaptation_1_3 | OutsideEU: Adaptation_1_3 | UnauthorizedAccess: Adaptation_2_3 | UnauthorizedAccess: Adaptation_2_3 | ","5","5.006399999999999"
"RandomSearch","1","2","9.4200182","Risk: ""UnauthorizedAccess"" | Risk: ""UnauthorizedAccess"" | Risk: ""OutsideEU"" | Risk: ""OutsideEU"" | ","UnauthorizedAccess: Adaptation_2_3 | OutsideEU: Adaptation_1_3 | UnauthorizedAccess: Adaptation_2_2 | OutsideEU: Adaptation_1_3 | ","5","5.006399999999999"
"BestFirstSearch","1","3","9.3125524","Risk: ""UnauthorizedAccess"" | Risk: ""UnauthorizedAccess"" | Risk: ""OutsideEU"" | Risk: ""OutsideEU"" | ","OutsideEU: Adaptation_1_3 | OutsideEU: Adaptation_1_3 | UnauthorizedAccess: Adaptation_2_3 | UnauthorizedAccess: Adaptation_2_3 | ","5","5.006399999999999"
"DepthSearch","1","3","9.2392426","Risk: ""UnauthorizedAccess"" | Risk: ""UnauthorizedAccess"" | Risk: ""OutsideEU"" | Risk: ""OutsideEU"" | ","UnauthorizedAccess: Adaptation_2_3 | UnauthorizedAccess: Adaptation_2_2 | OutsideEU: Adaptation_1_3 | OutsideEU: Adaptation_1_3 | ","5","5.006399999999999"
"BreadthSearch","1","3","9.4873792","Risk: ""UnauthorizedAccess"" | Risk: ""UnauthorizedAccess"" | Risk: ""OutsideEU"" | Risk: ""OutsideEU"" | ","OutsideEU: Adaptation_1_3 | OutsideEU: Adaptation_1_3 | UnauthorizedAccess: Adaptation_2_3 | UnauthorizedAccess: Adaptation_2_3 | ","5","5.006399999999999"
"RandomSearch","1","3","8.9453051","Risk: ""UnauthorizedAccess"" | Risk: ""UnauthorizedAccess"" | Risk: ""OutsideEU"" | Risk: ""OutsideEU"" | ","OutsideEU: Adaptation_1_3 | UnauthorizedAccess: Adaptation_2_3 | UnauthorizedAccess: Adaptation_2_2 | OutsideEU: Adaptation_1_3 | ","5","5.006399999999999"
"BestFirstSearch","1","4","9.1039181","Risk: ""UnauthorizedAccess"" | Risk: ""UnauthorizedAccess"" | Risk: ""OutsideEU"" | Risk: ""OutsideEU"" | ","OutsideEU: Adaptation_1_3 | OutsideEU: Adaptation_1_3 | UnauthorizedAccess: Adaptation_2_3 | UnauthorizedAccess: Adaptation_2_3 | ","5","5.006399999999999"
"DepthSearch","1","4","9.7179555","Risk: ""UnauthorizedAccess"" | Risk: ""UnauthorizedAccess"" | Risk: ""OutsideEU"" | Risk: ""OutsideEU"" | ","UnauthorizedAccess: Adaptation_2_3 | UnauthorizedAccess: Adaptation_2_2 | OutsideEU: Adaptation_1_3 | OutsideEU: Adaptation_1_3 | ","5","5.006399999999999"
"BreadthSearch","1","4","9.7441464","Risk: ""UnauthorizedAccess"" | Risk: ""UnauthorizedAccess"" | Risk: ""OutsideEU"" | Risk: ""OutsideEU"" | ","OutsideEU: Adaptation_1_3 | OutsideEU: Adaptation_1_3 | UnauthorizedAccess: Adaptation_2_3 | UnauthorizedAccess: Adaptation_2_3 | ","5","5.006399999999999"
"RandomSearch","1","4","9.2224579","Risk: ""UnauthorizedAccess"" | Risk: ""UnauthorizedAccess"" | Risk: ""OutsideEU"" | Risk: ""OutsideEU"" | ","UnauthorizedAccess: Adaptation_2_3 | OutsideEU: Adaptation_1_3 | UnauthorizedAccess: Adaptation_2_3 | OutsideEU: Adaptation_1_3 | ","5","5.006399999999999"
"BestFirstSearch","1","5","8.9141936","Risk: ""UnauthorizedAccess"" | Risk: ""UnauthorizedAccess"" | Risk: ""OutsideEU"" | Risk: ""OutsideEU"" | ","OutsideEU: Adaptation_1_3 | OutsideEU: Adaptation_1_3 | UnauthorizedAccess: Adaptation_2_3 | UnauthorizedAccess: Adaptation_2_3 | ","5","5.006399999999999"
"DepthSearch","1","5","8.8395577","Risk: ""UnauthorizedAccess"" | Risk: ""UnauthorizedAccess"" | Risk: ""OutsideEU"" | Risk: ""OutsideEU"" | ","UnauthorizedAccess: Adaptation_2_3 | UnauthorizedAccess: Adaptation_2_3 | OutsideEU: Adaptation_1_3 | OutsideEU: Adaptation_1_3 | ","5","5.006399999999999"
"BreadthSearch","1","5","9.052223","Risk: ""UnauthorizedAccess"" | Risk: ""UnauthorizedAccess"" | Risk: ""OutsideEU"" | Risk: ""OutsideEU"" | ","OutsideEU: Adaptation_1_3 | OutsideEU: Adaptation_1_3 | UnauthorizedAccess: Adaptation_2_3 | UnauthorizedAccess: Adaptation_2_3 | ","5","5.006399999999999"
"RandomSearch","1","5","9.0680936","Risk: ""UnauthorizedAccess"" | Risk: ""UnauthorizedAccess"" | Risk: ""OutsideEU"" | Risk: ""OutsideEU"" | ","UnauthorizedAccess: Adaptation_2_3 | OutsideEU: Adaptation_1_3 | OutsideEU: Adaptation_1_3 | UnauthorizedAccess: Adaptation_2_3 | ","5","5.006399999999999"
"BestFirstSearch","1","6","8.6625958","Risk: ""UnauthorizedAccess"" | Risk: ""UnauthorizedAccess"" | Risk: ""OutsideEU"" | Risk: ""OutsideEU"" | ","OutsideEU: Adaptation_1_3 | OutsideEU: Adaptation_1_3 | UnauthorizedAccess: Adaptation_2_3 | UnauthorizedAccess: Adaptation_2_3 | ","5","5.006399999999999"
"DepthSearch","1","6","8.6067828","Risk: ""UnauthorizedAccess"" | Risk: ""UnauthorizedAccess"" | Risk: ""OutsideEU"" | Risk: ""OutsideEU"" | ","UnauthorizedAccess: Adaptation_2_3 | UnauthorizedAccess: Adaptation_2_2 | OutsideEU: Adaptation_1_3 | OutsideEU: Adaptation_1_3 | ","5","5.006399999999999"
"BreadthSearch","1","6","8.9477831","Risk: ""UnauthorizedAccess"" | Risk: ""UnauthorizedAccess"" | Risk: ""OutsideEU"" | Risk: ""OutsideEU"" | ","OutsideEU: Adaptation_1_3 | OutsideEU: Adaptation_1_3 | UnauthorizedAccess: Adaptation_2_3 | UnauthorizedAccess: Adaptation_2_3 | ","5","5.006399999999999"
"RandomSearch","1","6","8.911197","Risk: ""UnauthorizedAccess"" | Risk: ""UnauthorizedAccess"" | Risk: ""OutsideEU"" | Risk: ""OutsideEU"" | ","OutsideEU: Adaptation_1_3 | OutsideEU: Adaptation_1_3 | UnauthorizedAccess: Adaptation_2_3 | UnauthorizedAccess: Adaptation_2_3 | ","5","5.006399999999999"
"BestFirstSearch","1","7","8.7645105","Risk: ""UnauthorizedAccess"" | Risk: ""UnauthorizedAccess"" | Risk: ""OutsideEU"" | Risk: ""OutsideEU"" | ","OutsideEU: Adaptation_1_3 | OutsideEU: Adaptation_1_3 | UnauthorizedAccess: Adaptation_2_3 | UnauthorizedAccess: Adaptation_2_3 | ","5","5.006399999999999"
"DepthSearch","1","7","8.6878092","Risk: ""UnauthorizedAccess"" | Risk: ""UnauthorizedAccess"" | Risk: ""OutsideEU"" | Risk: ""OutsideEU"" | ","UnauthorizedAccess: Adaptation_2_3 | UnauthorizedAccess: Adaptation_2_3 | OutsideEU: Adaptation_1_3 | OutsideEU: Adaptation_1_3 | ","5","5.006399999999999"
"BreadthSearch","1","7","8.9115901","Risk: ""UnauthorizedAccess"" | Risk: ""UnauthorizedAccess"" | Risk: ""OutsideEU"" | Risk: ""OutsideEU"" | ","OutsideEU: Adaptation_1_3 | OutsideEU: Adaptation_1_3 | UnauthorizedAccess: Adaptation_2_3 | UnauthorizedAccess: Adaptation_2_3 | ","5","5.006399999999999"
"RandomSearch","1","7","9.0582014","Risk: ""UnauthorizedAccess"" | Risk: ""UnauthorizedAccess"" | Risk: ""OutsideEU"" | Risk: ""OutsideEU"" | ","UnauthorizedAccess: Adaptation_2_3 | UnauthorizedAccess: Adaptation_2_2 | OutsideEU: Adaptation_1_3 | OutsideEU: Adaptation_1_3 | ","5","5.006399999999999"
"BestFirstSearch","1","8","8.8259101","Risk: ""UnauthorizedAccess"" | Risk: ""UnauthorizedAccess"" | Risk: ""OutsideEU"" | Risk: ""OutsideEU"" | ","OutsideEU: Adaptation_1_3 | OutsideEU: Adaptation_1_3 | UnauthorizedAccess: Adaptation_2_3 | UnauthorizedAccess: Adaptation_2_3 | ","5","5.006399999999999"
"DepthSearch","1","8","8.53949","Risk: ""UnauthorizedAccess"" | Risk: ""UnauthorizedAccess"" | Risk: ""OutsideEU"" | Risk: ""OutsideEU"" | ","UnauthorizedAccess: Adaptation_2_3 | UnauthorizedAccess: Adaptation_2_3 | OutsideEU: Adaptation_1_3 | OutsideEU: Adaptation_1_3 | ","5","5.006399999999999"
"BreadthSearch","1","8","8.9199649","Risk: ""UnauthorizedAccess"" | Risk: ""UnauthorizedAccess"" | Risk: ""OutsideEU"" | Risk: ""OutsideEU"" | ","OutsideEU: Adaptation_1_3 | OutsideEU: Adaptation_1_3 | UnauthorizedAccess: Adaptation_2_3 | UnauthorizedAccess: Adaptation_2_3 | ","5","5.006399999999999"
"RandomSearch","1","8","8.9278714","Risk: ""UnauthorizedAccess"" | Risk: ""UnauthorizedAccess"" | Risk: ""OutsideEU"" | Risk: ""OutsideEU"" | ","OutsideEU: Adaptation_1_3 | UnauthorizedAccess: Adaptation_2_3 | OutsideEU: Adaptation_1_3 | UnauthorizedAccess: Adaptation_2_3 | ","5","5.006399999999999"
"BestFirstSearch","1","9","8.993785","Risk: ""UnauthorizedAccess"" | Risk: ""UnauthorizedAccess"" | Risk: ""OutsideEU"" | Risk: ""OutsideEU"" | ","OutsideEU: Adaptation_1_3 | OutsideEU: Adaptation_1_3 | UnauthorizedAccess: Adaptation_2_3 | UnauthorizedAccess: Adaptation_2_3 | ","5","5.006399999999999"
"DepthSearch","1","9","8.469162","Risk: ""UnauthorizedAccess"" | Risk: ""UnauthorizedAccess"" | Risk: ""OutsideEU"" | Risk: ""OutsideEU"" | ","UnauthorizedAccess: Adaptation_2_3 | UnauthorizedAccess: Adaptation_2_3 | OutsideEU: Adaptation_1_3 | OutsideEU: Adaptation_1_3 | ","5","5.006399999999999"
"BreadthSearch","1","9","8.8898075","Risk: ""UnauthorizedAccess"" | Risk: ""UnauthorizedAccess"" | Risk: ""OutsideEU"" | Risk: ""OutsideEU"" | ","OutsideEU: Adaptation_1_3 | OutsideEU: Adaptation_1_3 | UnauthorizedAccess: Adaptation_2_3 | UnauthorizedAccess: Adaptation_2_3 | ","5","5.006399999999999"
"RandomSearch","1","9","8.8940481","Risk: ""UnauthorizedAccess"" | Risk: ""UnauthorizedAccess"" | Risk: ""OutsideEU"" | Risk: ""OutsideEU"" | ","UnauthorizedAccess: Adaptation_2_3 | UnauthorizedAccess: Adaptation_2_3 | OutsideEU: Adaptation_1_3 | OutsideEU: Adaptation_1_3 | ","5","5.006399999999999"
"BestFirstSearch","2","0","60.0491237","Risk: ""UnauthorizedAccess"" | Risk: ""UnauthorizedAccess"" | Risk: ""UnauthorizedAccess"" | Risk: ""OutsideEU"" | Risk: ""OutsideEU"" | Risk: ""OutsideEU"" | ","OutsideEU: Adaptation_1_3 | OutsideEU: Adaptation_1_3 | OutsideEU: Adaptation_1_3 | UnauthorizedAccess: Adaptation_2_3 | UnauthorizedAccess: Adaptation_2_3 | UnauthorizedAccess: Adaptation_2_3 | ","7","7.233599999999999"
"DepthSearch","2","0","60.0463503","Risk: ""UnauthorizedAccess"" | Risk: ""UnauthorizedAccess"" | Risk: ""UnauthorizedAccess"" | Risk: ""OutsideEU"" | Risk: ""OutsideEU"" | Risk: ""OutsideEU"" | ","UnauthorizedAccess: Adaptation_2_3 | UnauthorizedAccess: Adaptation_2_3 | UnauthorizedAccess: Adaptation_2_3 | OutsideEU: Adaptation_1_3 | OutsideEU: Adaptation_1_3 | OutsideEU: Adaptation_1_3 | ","7","7.233599999999999"
"BreadthSearch","2","0","60.7819062","Risk: ""UnauthorizedAccess"" | Risk: ""UnauthorizedAccess"" | Risk: ""UnauthorizedAccess"" | Risk: ""OutsideEU"" | Risk: ""OutsideEU"" | Risk: ""OutsideEU"" | ","OutsideEU: Adaptation_1_3 | UnauthorizedAccess: Adaptation_2_3 | UnauthorizedAccess: Adaptation_2_2 | UnauthorizedAccess: Adaptation_2_2 | ","3","2.7792"
"RandomSearch","2","0","60.8073072","Risk: ""UnauthorizedAccess"" | Risk: ""UnauthorizedAccess"" | Risk: ""UnauthorizedAccess"" | Risk: ""OutsideEU"" | Risk: ""OutsideEU"" | Risk: ""OutsideEU"" | ","UnauthorizedAccess: Adaptation_2_3 | UnauthorizedAccess: Adaptation_2_3 | OutsideEU: Adaptation_1_3 | OutsideEU: Adaptation_1_3 | OutsideEU: Adaptation_1_3 | UnauthorizedAccess: Adaptation_2_3 | ","7","7.233599999999999"
"BestFirstSearch","2","1","60.1121345","Risk: ""UnauthorizedAccess"" | Risk: ""UnauthorizedAccess"" | Risk: ""UnauthorizedAccess"" | Risk: ""OutsideEU"" | Risk: ""OutsideEU"" | Risk: ""OutsideEU"" | ","OutsideEU: Adaptation_1_3 | OutsideEU: Adaptation_1_3 | OutsideEU: Adaptation_1_3 | UnauthorizedAccess: Adaptation_2_3 | UnauthorizedAccess: Adaptation_2_3 | UnauthorizedAccess: Adaptation_2_3 | ","7","7.233599999999999"
"DepthSearch","2","1","60.0625738","Risk: ""UnauthorizedAccess"" | Risk: ""UnauthorizedAccess"" | Risk: ""UnauthorizedAccess"" | Risk: ""OutsideEU"" | Risk: ""OutsideEU"" | Risk: ""OutsideEU"" | ","UnauthorizedAccess: Adaptation_2_3 | UnauthorizedAccess: Adaptation_2_3 | UnauthorizedAccess: Adaptation_2_3 | OutsideEU: Adaptation_1_2 | OutsideEU: Adaptation_1_2 | OutsideEU: Adaptation_1_2 | ","7","8.9088"
"BreadthSearch","2","1","60.4394062","Risk: ""UnauthorizedAccess"" | Risk: ""UnauthorizedAccess"" | Risk: ""UnauthorizedAccess"" | Risk: ""OutsideEU"" | Risk: ""OutsideEU"" | Risk: ""OutsideEU"" | ","OutsideEU: Adaptation_1_3 | UnauthorizedAccess: Adaptation_2_3 | UnauthorizedAccess: Adaptation_2_2 | UnauthorizedAccess: Adaptation_2_2 | ","3","2.7792"
"RandomSearch","2","1","60.1964936","Risk: ""UnauthorizedAccess"" | Risk: ""UnauthorizedAccess"" | Risk: ""UnauthorizedAccess"" | Risk: ""OutsideEU"" | Risk: ""OutsideEU"" | Risk: ""OutsideEU"" | ","OutsideEU: Adaptation_1_3 | UnauthorizedAccess: Adaptation_2_3 | UnauthorizedAccess: Adaptation_2_2 | OutsideEU: Adaptation_1_3 | UnauthorizedAccess: Adaptation_2_2 | OutsideEU: Adaptation_1_3 | ","7","7.233599999999999"
"BestFirstSearch","2","2","60.0488074","Risk: ""UnauthorizedAccess"" | Risk: ""UnauthorizedAccess"" | Risk: ""UnauthorizedAccess"" | Risk: ""OutsideEU"" | Risk: ""OutsideEU"" | Risk: ""OutsideEU"" | ","OutsideEU: Adaptation_1_3 | OutsideEU: Adaptation_1_3 | OutsideEU: Adaptation_1_3 | UnauthorizedAccess: Adaptation_2_3 | UnauthorizedAccess: Adaptation_2_3 | UnauthorizedAccess: Adaptation_2_3 | ","7","7.233599999999999"
"DepthSearch","2","2","60.0381369","Risk: ""UnauthorizedAccess"" | Risk: ""UnauthorizedAccess"" | Risk: ""UnauthorizedAccess"" | Risk: ""OutsideEU"" | Risk: ""OutsideEU"" | Risk: ""OutsideEU"" | ","UnauthorizedAccess: Adaptation_2_3 | UnauthorizedAccess: Adaptation_2_2 | UnauthorizedAccess: Adaptation_2_2 | OutsideEU: Adaptation_1_3 | OutsideEU: Adaptation_1_3 | OutsideEU: Adaptation_1_3 | ","7","7.233599999999999"
"BreadthSearch","2","2","60.6007743","Risk: ""UnauthorizedAccess"" | Risk: ""UnauthorizedAccess"" | Risk: ""UnauthorizedAccess"" | Risk: ""OutsideEU"" | Risk: ""OutsideEU"" | Risk: ""OutsideEU"" | ","OutsideEU: Adaptation_1_3 | UnauthorizedAccess: Adaptation_2_3 | UnauthorizedAccess: Adaptation_2_2 | UnauthorizedAccess: Adaptation_2_2 | ","3","2.7792"
"RandomSearch","2","2","60.0493147","Risk: ""UnauthorizedAccess"" | Risk: ""UnauthorizedAccess"" | Risk: ""UnauthorizedAccess"" | Risk: ""OutsideEU"" | Risk: ""OutsideEU"" | Risk: ""OutsideEU"" | ","UnauthorizedAccess: Adaptation_2_3 | OutsideEU: Adaptation_1_2 | UnauthorizedAccess: Adaptation_2_2 | UnauthorizedAccess: Adaptation_2_2 | OutsideEU: Adaptation_1_2 | OutsideEU: Adaptation_1_2 | ","7","8.9088"
"BestFirstSearch","2","3","60.0590775","Risk: ""UnauthorizedAccess"" | Risk: ""UnauthorizedAccess"" | Risk: ""UnauthorizedAccess"" | Risk: ""OutsideEU"" | Risk: ""OutsideEU"" | Risk: ""OutsideEU"" | ","OutsideEU: Adaptation_1_3 | OutsideEU: Adaptation_1_3 | OutsideEU: Adaptation_1_3 | UnauthorizedAccess: Adaptation_2_3 | UnauthorizedAccess: Adaptation_2_3 | UnauthorizedAccess: Adaptation_2_3 | ","7","7.233599999999999"
"DepthSearch","2","3","60.0457995","Risk: ""UnauthorizedAccess"" | Risk: ""UnauthorizedAccess"" | Risk: ""UnauthorizedAccess"" | Risk: ""OutsideEU"" | Risk: ""OutsideEU"" | Risk: ""OutsideEU"" | ","UnauthorizedAccess: Adaptation_2_3 | UnauthorizedAccess: Adaptation_2_3 | UnauthorizedAccess: Adaptation_2_3 | OutsideEU: Adaptation_1_3 | OutsideEU: Adaptation_1_3 | OutsideEU: Adaptation_1_3 | ","7","7.233599999999999"
"BreadthSearch","2","3","60.7024088","Risk: ""UnauthorizedAccess"" | Risk: ""UnauthorizedAccess"" | Risk: ""UnauthorizedAccess"" | Risk: ""OutsideEU"" | Risk: ""OutsideEU"" | Risk: ""OutsideEU"" | ","OutsideEU: Adaptation_1_3 | UnauthorizedAccess: Adaptation_2_3 | UnauthorizedAccess: Adaptation_2_2 | UnauthorizedAccess: Adaptation_2_2 | ","3","2.7792"
"RandomSearch","2","3","61.139621","Risk: ""UnauthorizedAccess"" | Risk: ""UnauthorizedAccess"" | Risk: ""UnauthorizedAccess"" | Risk: ""OutsideEU"" | Risk: ""OutsideEU"" | Risk: ""OutsideEU"" | ","OutsideEU: Adaptation_1_3 | UnauthorizedAccess: Adaptation_2_3 | UnauthorizedAccess: Adaptation_2_3 | OutsideEU: Adaptation_1_3 | UnauthorizedAccess: Adaptation_2_2 | OutsideEU: Adaptation_1_3 | ","7","7.233599999999999"
"BestFirstSearch","2","4","60.0428218","Risk: ""UnauthorizedAccess"" | Risk: ""UnauthorizedAccess"" | Risk: ""UnauthorizedAccess"" | Risk: ""OutsideEU"" | Risk: ""OutsideEU"" | Risk: ""OutsideEU"" | ","OutsideEU: Adaptation_1_3 | OutsideEU: Adaptation_1_3 | OutsideEU: Adaptation_1_3 | UnauthorizedAccess: Adaptation_2_3 | UnauthorizedAccess: Adaptation_2_3 | UnauthorizedAccess: Adaptation_2_3 | ","7","7.233599999999999"
"DepthSearch","2","4","60.031726","Risk: ""UnauthorizedAccess"" | Risk: ""UnauthorizedAccess"" | Risk: ""UnauthorizedAccess"" | Risk: ""OutsideEU"" | Risk: ""OutsideEU"" | Risk: ""OutsideEU"" | ","UnauthorizedAccess: Adaptation_2_3 | UnauthorizedAccess: Adaptation_2_3 | UnauthorizedAccess: Adaptation_2_3 | OutsideEU: Adaptation_1_2 | OutsideEU: Adaptation_1_2 | OutsideEU: Adaptation_1_2 | ","7","8.9088"
"BreadthSearch","2","4","60.0318647","Risk: ""UnauthorizedAccess"" | Risk: ""UnauthorizedAccess"" | Risk: ""UnauthorizedAccess"" | Risk: ""OutsideEU"" | Risk: ""OutsideEU"" | Risk: ""OutsideEU"" | ","OutsideEU: Adaptation_1_3 | UnauthorizedAccess: Adaptation_2_3 | UnauthorizedAccess: Adaptation_2_2 | UnauthorizedAccess: Adaptation_2_2 | ","3","2.7792"
"RandomSearch","2","4","60.8365332","Risk: ""UnauthorizedAccess"" | Risk: ""UnauthorizedAccess"" | Risk: ""UnauthorizedAccess"" | Risk: ""OutsideEU"" | Risk: ""OutsideEU"" | Risk: ""OutsideEU"" | ","UnauthorizedAccess: Adaptation_2_3 | OutsideEU: Adaptation_1_3 | OutsideEU: Adaptation_1_3 | UnauthorizedAccess: Adaptation_2_3 | OutsideEU: Adaptation_1_3 | UnauthorizedAccess: Adaptation_2_3 | ","7","7.233599999999999"
"BestFirstSearch","2","5","60.0698107","Risk: ""UnauthorizedAccess"" | Risk: ""UnauthorizedAccess"" | Risk: ""UnauthorizedAccess"" | Risk: ""OutsideEU"" | Risk: ""OutsideEU"" | Risk: ""OutsideEU"" | ","OutsideEU: Adaptation_1_3 | OutsideEU: Adaptation_1_3 | OutsideEU: Adaptation_1_3 | UnauthorizedAccess: Adaptation_2_3 | UnauthorizedAccess: Adaptation_2_3 | UnauthorizedAccess: Adaptation_2_3 | ","7","7.233599999999999"
"DepthSearch","2","5","60.0408731","Risk: ""UnauthorizedAccess"" | Risk: ""UnauthorizedAccess"" | Risk: ""UnauthorizedAccess"" | Risk: ""OutsideEU"" | Risk: ""OutsideEU"" | Risk: ""OutsideEU"" | ","UnauthorizedAccess: Adaptation_2_3 | UnauthorizedAccess: Adaptation_2_3 | UnauthorizedAccess: Adaptation_2_3 | OutsideEU: Adaptation_1_3 | OutsideEU: Adaptation_1_3 | OutsideEU: Adaptation_1_3 | ","7","7.233599999999999"
"BreadthSearch","2","5","60.0285442","Risk: ""UnauthorizedAccess"" | Risk: ""UnauthorizedAccess"" | Risk: ""UnauthorizedAccess"" | Risk: ""OutsideEU"" | Risk: ""OutsideEU"" | Risk: ""OutsideEU"" | ","OutsideEU: Adaptation_1_3 | UnauthorizedAccess: Adaptation_2_3 | UnauthorizedAccess: Adaptation_2_2 | UnauthorizedAccess: Adaptation_2_2 | ","3","2.7792"
"RandomSearch","2","5","60.0339705","Risk: ""UnauthorizedAccess"" | Risk: ""UnauthorizedAccess"" | Risk: ""UnauthorizedAccess"" | Risk: ""OutsideEU"" | Risk: ""OutsideEU"" | Risk: ""OutsideEU"" | ","UnauthorizedAccess: Adaptation_2_3 | OutsideEU: Adaptation_1_3 | OutsideEU: Adaptation_1_3 | UnauthorizedAccess: Adaptation_2_3 | OutsideEU: Adaptation_1_3 | UnauthorizedAccess: Adaptation_2_3 | ","7","7.233599999999999"
"BestFirstSearch","2","6","60.0752095","Risk: ""UnauthorizedAccess"" | Risk: ""UnauthorizedAccess"" | Risk: ""UnauthorizedAccess"" | Risk: ""OutsideEU"" | Risk: ""OutsideEU"" | Risk: ""OutsideEU"" | ","OutsideEU: Adaptation_1_3 | OutsideEU: Adaptation_1_3 | OutsideEU: Adaptation_1_3 | UnauthorizedAccess: Adaptation_2_3 | UnauthorizedAccess: Adaptation_2_3 | UnauthorizedAccess: Adaptation_2_3 | ","7","7.233599999999999"
"DepthSearch","2","6","60.0378942","Risk: ""UnauthorizedAccess"" | Risk: ""UnauthorizedAccess"" | Risk: ""UnauthorizedAccess"" | Risk: ""OutsideEU"" | Risk: ""OutsideEU"" | Risk: ""OutsideEU"" | ","UnauthorizedAccess: Adaptation_2_3 | UnauthorizedAccess: Adaptation_2_2 | UnauthorizedAccess: Adaptation_2_2 | OutsideEU: Adaptation_1_3 | OutsideEU: Adaptation_1_3 | OutsideEU: Adaptation_1_1 | ","5","5.006399999999999"
"BreadthSearch","2","6","60.8353025","Risk: ""UnauthorizedAccess"" | Risk: ""UnauthorizedAccess"" | Risk: ""UnauthorizedAccess"" | Risk: ""OutsideEU"" | Risk: ""OutsideEU"" | Risk: ""OutsideEU"" | ","OutsideEU: Adaptation_1_3 | UnauthorizedAccess: Adaptation_2_3 | UnauthorizedAccess: Adaptation_2_2 | UnauthorizedAccess: Adaptation_2_2 | ","3","2.7792"
"RandomSearch","2","6","60.035234","Risk: ""UnauthorizedAccess"" | Risk: ""UnauthorizedAccess"" | Risk: ""UnauthorizedAccess"" | Risk: ""OutsideEU"" | Risk: ""OutsideEU"" | Risk: ""OutsideEU"" | ","UnauthorizedAccess: Adaptation_2_3 | OutsideEU: Adaptation_1_3 | UnauthorizedAccess: Adaptation_2_2 | OutsideEU: Adaptation_1_3 | UnauthorizedAccess: Adaptation_2_2 | OutsideEU: Adaptation_1_3 | ","7","7.233599999999999"
"BestFirstSearch","2","7","60.078645","Risk: ""UnauthorizedAccess"" | Risk: ""UnauthorizedAccess"" | Risk: ""UnauthorizedAccess"" | Risk: ""OutsideEU"" | Risk: ""OutsideEU"" | Risk: ""OutsideEU"" | ","OutsideEU: Adaptation_1_3 | OutsideEU: Adaptation_1_3 | OutsideEU: Adaptation_1_3 | UnauthorizedAccess: Adaptation_2_3 | UnauthorizedAccess: Adaptation_2_3 | UnauthorizedAccess: Adaptation_2_3 | ","7","7.233599999999999"
"DepthSearch","2","7","60.0410955","Risk: ""UnauthorizedAccess"" | Risk: ""UnauthorizedAccess"" | Risk: ""UnauthorizedAccess"" | Risk: ""OutsideEU"" | Risk: ""OutsideEU"" | Risk: ""OutsideEU"" | ","UnauthorizedAccess: Adaptation_2_3 | UnauthorizedAccess: Adaptation_2_3 | UnauthorizedAccess: Adaptation_2_3 | OutsideEU: Adaptation_1_3 | OutsideEU: Adaptation_1_3 | OutsideEU: Adaptation_1_3 | ","7","7.233599999999999"
"BreadthSearch","2","7","60.8947681","Risk: ""UnauthorizedAccess"" | Risk: ""UnauthorizedAccess"" | Risk: ""UnauthorizedAccess"" | Risk: ""OutsideEU"" | Risk: ""OutsideEU"" | Risk: ""OutsideEU"" | ","OutsideEU: Adaptation_1_3 | UnauthorizedAccess: Adaptation_2_3 | UnauthorizedAccess: Adaptation_2_2 | UnauthorizedAccess: Adaptation_2_2 | ","3","2.7792"
"RandomSearch","2","7","60.3948936","Risk: ""UnauthorizedAccess"" | Risk: ""UnauthorizedAccess"" | Risk: ""UnauthorizedAccess"" | Risk: ""OutsideEU"" | Risk: ""OutsideEU"" | Risk: ""OutsideEU"" | ","UnauthorizedAccess: Adaptation_2_3 | OutsideEU: Adaptation_1_3 | UnauthorizedAccess: Adaptation_2_3 | OutsideEU: Adaptation_1_3 | UnauthorizedAccess: Adaptation_2_3 | OutsideEU: Adaptation_1_3 | ","7","7.233599999999999"
"BestFirstSearch","2","8","60.0289667","Risk: ""UnauthorizedAccess"" | Risk: ""UnauthorizedAccess"" | Risk: ""UnauthorizedAccess"" | Risk: ""OutsideEU"" | Risk: ""OutsideEU"" | Risk: ""OutsideEU"" | ","OutsideEU: Adaptation_1_3 | OutsideEU: Adaptation_1_3 | OutsideEU: Adaptation_1_3 | UnauthorizedAccess: Adaptation_2_3 | UnauthorizedAccess: Adaptation_2_3 | UnauthorizedAccess: Adaptation_2_3 | ","7","7.233599999999999"
"DepthSearch","2","8","60.206804","Risk: ""UnauthorizedAccess"" | Risk: ""UnauthorizedAccess"" | Risk: ""UnauthorizedAccess"" | Risk: ""OutsideEU"" | Risk: ""OutsideEU"" | Risk: ""OutsideEU"" | ","UnauthorizedAccess: Adaptation_2_3 | UnauthorizedAccess: Adaptation_2_2 | UnauthorizedAccess: Adaptation_2_2 | OutsideEU: Adaptation_1_3 | OutsideEU: Adaptation_1_3 | OutsideEU: Adaptation_1_3 | ","7","7.233599999999999"
"BreadthSearch","2","8","60.0228312","Risk: ""UnauthorizedAccess"" | Risk: ""UnauthorizedAccess"" | Risk: ""UnauthorizedAccess"" | Risk: ""OutsideEU"" | Risk: ""OutsideEU"" | Risk: ""OutsideEU"" | ","OutsideEU: Adaptation_1_3 | UnauthorizedAccess: Adaptation_2_3 | UnauthorizedAccess: Adaptation_2_2 | UnauthorizedAccess: Adaptation_2_2 | ","3","2.7792"
"RandomSearch","2","8","60.0278808","Risk: ""UnauthorizedAccess"" | Risk: ""UnauthorizedAccess"" | Risk: ""UnauthorizedAccess"" | Risk: ""OutsideEU"" | Risk: ""OutsideEU"" | Risk: ""OutsideEU"" | ","OutsideEU: Adaptation_1_3 | UnauthorizedAccess: Adaptation_2_3 | UnauthorizedAccess: Adaptation_2_2 | OutsideEU: Adaptation_1_3 | UnauthorizedAccess: Adaptation_2_3 | OutsideEU: Adaptation_1_3 | ","7","7.233599999999999"
"BestFirstSearch","2","9","60.0541231","Risk: ""UnauthorizedAccess"" | Risk: ""UnauthorizedAccess"" | Risk: ""UnauthorizedAccess"" | Risk: ""OutsideEU"" | Risk: ""OutsideEU"" | Risk: ""OutsideEU"" | ","OutsideEU: Adaptation_1_3 | OutsideEU: Adaptation_1_3 | OutsideEU: Adaptation_1_3 | UnauthorizedAccess: Adaptation_2_3 | UnauthorizedAccess: Adaptation_2_3 | UnauthorizedAccess: Adaptation_2_3 | ","7","7.233599999999999"
"DepthSearch","2","9","60.0371503","Risk: ""UnauthorizedAccess"" | Risk: ""UnauthorizedAccess"" | Risk: ""UnauthorizedAccess"" | Risk: ""OutsideEU"" | Risk: ""OutsideEU"" | Risk: ""OutsideEU"" | ","UnauthorizedAccess: Adaptation_2_3 | UnauthorizedAccess: Adaptation_2_2 | UnauthorizedAccess: Adaptation_2_2 | OutsideEU: Adaptation_1_2 | OutsideEU: Adaptation_1_2 | OutsideEU: Adaptation_1_2 | ","7","8.9088"
"BreadthSearch","2","9","60.0300204","Risk: ""UnauthorizedAccess"" | Risk: ""UnauthorizedAccess"" | Risk: ""UnauthorizedAccess"" | Risk: ""OutsideEU"" | Risk: ""OutsideEU"" | Risk: ""OutsideEU"" | ","OutsideEU: Adaptation_1_3 | UnauthorizedAccess: Adaptation_2_3 | UnauthorizedAccess: Adaptation_2_2 | UnauthorizedAccess: Adaptation_2_2 | ","3","2.7792"
"RandomSearch","2","9","60.8220598","Risk: ""UnauthorizedAccess"" | Risk: ""UnauthorizedAccess"" | Risk: ""UnauthorizedAccess"" | Risk: ""OutsideEU"" | Risk: ""OutsideEU"" | Risk: ""OutsideEU"" | ","OutsideEU: Adaptation_1_3 | UnauthorizedAccess: Adaptation_2_3 | UnauthorizedAccess: Adaptation_2_3 | OutsideEU: Adaptation_1_3 | UnauthorizedAccess: Adaptation_2_3 | OutsideEU: Adaptation_1_3 | ","7","7.233599999999999"
"BestFirstSearch","3","0","60.0443892","Risk: ""UnauthorizedAccess"" | Risk: ""UnauthorizedAccess"" | Risk: ""UnauthorizedAccess"" | Risk: ""UnauthorizedAccess"" | Risk: ""OutsideEU"" | Risk: ""OutsideEU"" | Risk: ""OutsideEU"" | Risk: ""OutsideEU"" | ","OutsideEU: Adaptation_1_3 | OutsideEU: Adaptation_1_3 | OutsideEU: Adaptation_1_3 | UnauthorizedAccess: Adaptation_2_3 | UnauthorizedAccess: Adaptation_2_3 | UnauthorizedAccess: Adaptation_2_3 | UnauthorizedAccess: Adaptation_2_2 | ","7","7.233599999999999"
"DepthSearch","3","0","60.0328","Risk: ""UnauthorizedAccess"" | Risk: ""UnauthorizedAccess"" | Risk: ""UnauthorizedAccess"" | Risk: ""UnauthorizedAccess"" | Risk: ""OutsideEU"" | Risk: ""OutsideEU"" | Risk: ""OutsideEU"" | Risk: ""OutsideEU"" | ","UnauthorizedAccess: Adaptation_2_3 | UnauthorizedAccess: Adaptation_2_2 | UnauthorizedAccess: Adaptation_2_2 | UnauthorizedAccess: Adaptation_2_2 | OutsideEU: Adaptation_1_2 | OutsideEU: Adaptation_1_2 | OutsideEU: Adaptation_1_2 | OutsideEU: Adaptation_1_2 | ","9","11.136"
"BreadthSearch","3","0","61.2259721","Risk: ""UnauthorizedAccess"" | Risk: ""UnauthorizedAccess"" | Risk: ""UnauthorizedAccess"" | Risk: ""UnauthorizedAccess"" | Risk: ""OutsideEU"" | Risk: ""OutsideEU"" | Risk: ""OutsideEU"" | Risk: ""OutsideEU"" | ","No possible adaptation found","",""
"RandomSearch","3","0","60.7849091","Risk: ""UnauthorizedAccess"" | Risk: ""UnauthorizedAccess"" | Risk: ""UnauthorizedAccess"" | Risk: ""UnauthorizedAccess"" | Risk: ""OutsideEU"" | Risk: ""OutsideEU"" | Risk: ""OutsideEU"" | Risk: ""OutsideEU"" | ","OutsideEU: Adaptation_1_3 | OutsideEU: Adaptation_1_3 | UnauthorizedAccess: Adaptation_2_3 | UnauthorizedAccess: Adaptation_2_3 | OutsideEU: Adaptation_1_3 | UnauthorizedAccess: Adaptation_2_3 | UnauthorizedAccess: Adaptation_2_3 | OutsideEU: Adaptation_1_3 | ","9","9.460799999999999"
"BestFirstSearch","3","1","60.0545785","Risk: ""UnauthorizedAccess"" | Risk: ""UnauthorizedAccess"" | Risk: ""UnauthorizedAccess"" | Risk: ""UnauthorizedAccess"" | Risk: ""OutsideEU"" | Risk: ""OutsideEU"" | Risk: ""OutsideEU"" | Risk: ""OutsideEU"" | ","OutsideEU: Adaptation_1_3 | OutsideEU: Adaptation_1_3 | OutsideEU: Adaptation_1_3 | UnauthorizedAccess: Adaptation_2_3 | UnauthorizedAccess: Adaptation_2_3 | UnauthorizedAccess: Adaptation_2_3 | UnauthorizedAccess: Adaptation_2_2 | ","7","7.233599999999999"
"DepthSearch","3","1","60.0801351","Risk: ""UnauthorizedAccess"" | Risk: ""UnauthorizedAccess"" | Risk: ""UnauthorizedAccess"" | Risk: ""UnauthorizedAccess"" | Risk: ""OutsideEU"" | Risk: ""OutsideEU"" | Risk: ""OutsideEU"" | Risk: ""OutsideEU"" | ","UnauthorizedAccess: Adaptation_2_3 | UnauthorizedAccess: Adaptation_2_2 | UnauthorizedAccess: Adaptation_2_2 | UnauthorizedAccess: Adaptation_2_2 | OutsideEU: Adaptation_1_3 | OutsideEU: Adaptation_1_3 | OutsideEU: Adaptation_1_3 | OutsideEU: Adaptation_1_3 | ","9","9.460799999999999"
"BreadthSearch","3","1","60.8019839","Risk: ""UnauthorizedAccess"" | Risk: ""UnauthorizedAccess"" | Risk: ""UnauthorizedAccess"" | Risk: ""UnauthorizedAccess"" | Risk: ""OutsideEU"" | Risk: ""OutsideEU"" | Risk: ""OutsideEU"" | Risk: ""OutsideEU"" | ","No possible adaptation found","",""
"RandomSearch","3","1","60.8709106","Risk: ""UnauthorizedAccess"" | Risk: ""UnauthorizedAccess"" | Risk: ""UnauthorizedAccess"" | Risk: ""UnauthorizedAccess"" | Risk: ""OutsideEU"" | Risk: ""OutsideEU"" | Risk: ""OutsideEU"" | Risk: ""OutsideEU"" | ","OutsideEU: Adaptation_1_2 | OutsideEU: Adaptation_1_2 | UnauthorizedAccess: Adaptation_2_3 | UnauthorizedAccess: Adaptation_2_3 | UnauthorizedAccess: Adaptation_2_3 | OutsideEU: Adaptation_1_2 | UnauthorizedAccess: Adaptation_2_3 | OutsideEU: Adaptation_1_2 | ","9","11.136"
"BestFirstSearch","3","2","60.0572227","Risk: ""UnauthorizedAccess"" | Risk: ""UnauthorizedAccess"" | Risk: ""UnauthorizedAccess"" | Risk: ""UnauthorizedAccess"" | Risk: ""OutsideEU"" | Risk: ""OutsideEU"" | Risk: ""OutsideEU"" | Risk: ""OutsideEU"" | ","OutsideEU: Adaptation_1_3 | OutsideEU: Adaptation_1_3 | OutsideEU: Adaptation_1_3 | UnauthorizedAccess: Adaptation_2_3 | UnauthorizedAccess: Adaptation_2_3 | UnauthorizedAccess: Adaptation_2_3 | UnauthorizedAccess: Adaptation_2_2 | ","7","7.233599999999999"
"DepthSearch","3","2","60.0733312","Risk: ""UnauthorizedAccess"" | Risk: ""UnauthorizedAccess"" | Risk: ""UnauthorizedAccess"" | Risk: ""UnauthorizedAccess"" | Risk: ""OutsideEU"" | Risk: ""OutsideEU"" | Risk: ""OutsideEU"" | Risk: ""OutsideEU"" | ","UnauthorizedAccess: Adaptation_2_3 | UnauthorizedAccess: Adaptation_2_2 | UnauthorizedAccess: Adaptation_2_2 | UnauthorizedAccess: Adaptation_2_2 | OutsideEU: Adaptation_1_3 | OutsideEU: Adaptation_1_3 | OutsideEU: Adaptation_1_3 | OutsideEU: Adaptation_1_3 | ","9","9.460799999999999"
"BreadthSearch","3","2","61.2515422","Risk: ""UnauthorizedAccess"" | Risk: ""UnauthorizedAccess"" | Risk: ""UnauthorizedAccess"" | Risk: ""UnauthorizedAccess"" | Risk: ""OutsideEU"" | Risk: ""OutsideEU"" | Risk: ""OutsideEU"" | Risk: ""OutsideEU"" | ","No possible adaptation found","",""
"RandomSearch","3","2","60.9811069","Risk: ""UnauthorizedAccess"" | Risk: ""UnauthorizedAccess"" | Risk: ""UnauthorizedAccess"" | Risk: ""UnauthorizedAccess"" | Risk: ""OutsideEU"" | Risk: ""OutsideEU"" | Risk: ""OutsideEU"" | Risk: ""OutsideEU"" | ","UnauthorizedAccess: Adaptation_2_3 | UnauthorizedAccess: Adaptation_2_2 | UnauthorizedAccess: Adaptation_2_2 | OutsideEU: Adaptation_1_3 | OutsideEU: Adaptation_1_3 | OutsideEU: Adaptation_1_3 | OutsideEU: Adaptation_1_3 | UnauthorizedAccess: Adaptation_2_3 | ","9","9.460799999999999"
"BestFirstSearch","3","3","60.0828606","Risk: ""UnauthorizedAccess"" | Risk: ""UnauthorizedAccess"" | Risk: ""UnauthorizedAccess"" | Risk: ""UnauthorizedAccess"" | Risk: ""OutsideEU"" | Risk: ""OutsideEU"" | Risk: ""OutsideEU"" | Risk: ""OutsideEU"" | ","OutsideEU: Adaptation_1_3 | OutsideEU: Adaptation_1_3 | OutsideEU: Adaptation_1_3 | UnauthorizedAccess: Adaptation_2_3 | UnauthorizedAccess: Adaptation_2_3 | UnauthorizedAccess: Adaptation_2_3 | UnauthorizedAccess: Adaptation_2_2 | ","7","7.233599999999999"
"DepthSearch","3","3","60.0632792","Risk: ""UnauthorizedAccess"" | Risk: ""UnauthorizedAccess"" | Risk: ""UnauthorizedAccess"" | Risk: ""UnauthorizedAccess"" | Risk: ""OutsideEU"" | Risk: ""OutsideEU"" | Risk: ""OutsideEU"" | Risk: ""OutsideEU"" | ","UnauthorizedAccess: Adaptation_2_3 | UnauthorizedAccess: Adaptation_2_2 | UnauthorizedAccess: Adaptation_2_2 | UnauthorizedAccess: Adaptation_2_2 | OutsideEU: Adaptation_1_2 | OutsideEU: Adaptation_1_2 | OutsideEU: Adaptation_1_2 | OutsideEU: Adaptation_1_2 | ","9","11.136"
"BreadthSearch","3","3","60.7888461","Risk: ""UnauthorizedAccess"" | Risk: ""UnauthorizedAccess"" | Risk: ""UnauthorizedAccess"" | Risk: ""UnauthorizedAccess"" | Risk: ""OutsideEU"" | Risk: ""OutsideEU"" | Risk: ""OutsideEU"" | Risk: ""OutsideEU"" | ","No possible adaptation found","",""
"RandomSearch","3","3","61.1230428","Risk: ""UnauthorizedAccess"" | Risk: ""UnauthorizedAccess"" | Risk: ""UnauthorizedAccess"" | Risk: ""UnauthorizedAccess"" | Risk: ""OutsideEU"" | Risk: ""OutsideEU"" | Risk: ""OutsideEU"" | Risk: ""OutsideEU"" | ","UnauthorizedAccess: Adaptation_2_3 | UnauthorizedAccess: Adaptation_2_2 | OutsideEU: Adaptation_1_3 | UnauthorizedAccess: Adaptation_2_2 | UnauthorizedAccess: Adaptation_2_2 | OutsideEU: Adaptation_1_3 | OutsideEU: Adaptation_1_3 | OutsideEU: Adaptation_1_3 | ","9","9.460799999999999"
"BestFirstSearch","3","4","60.0556554","Risk: ""UnauthorizedAccess"" | Risk: ""UnauthorizedAccess"" | Risk: ""UnauthorizedAccess"" | Risk: ""UnauthorizedAccess"" | Risk: ""OutsideEU"" | Risk: ""OutsideEU"" | Risk: ""OutsideEU"" | Risk: ""OutsideEU"" | ","OutsideEU: Adaptation_1_3 | OutsideEU: Adaptation_1_3 | OutsideEU: Adaptation_1_3 | UnauthorizedAccess: Adaptation_2_3 | UnauthorizedAccess: Adaptation_2_3 | UnauthorizedAccess: Adaptation_2_3 | UnauthorizedAccess: Adaptation_2_2 | ","7","7.233599999999999"
"DepthSearch","3","4","60.067622","Risk: ""UnauthorizedAccess"" | Risk: ""UnauthorizedAccess"" | Risk: ""UnauthorizedAccess"" | Risk: ""UnauthorizedAccess"" | Risk: ""OutsideEU"" | Risk: ""OutsideEU"" | Risk: ""OutsideEU"" | Risk: ""OutsideEU"" | ","UnauthorizedAccess: Adaptation_2_3 | UnauthorizedAccess: Adaptation_2_3 | UnauthorizedAccess: Adaptation_2_3 | UnauthorizedAccess: Adaptation_2_3 | OutsideEU: Adaptation_1_2 | OutsideEU: Adaptation_1_2 | OutsideEU: Adaptation_1_2 | OutsideEU: Adaptation_1_2 | ","9","11.136"
"BreadthSearch","3","4","61.0750136","Risk: ""UnauthorizedAccess"" | Risk: ""UnauthorizedAccess"" | Risk: ""UnauthorizedAccess"" | Risk: ""UnauthorizedAccess"" | Risk: ""OutsideEU"" | Risk: ""OutsideEU"" | Risk: ""OutsideEU"" | Risk: ""OutsideEU"" | ","No possible adaptation found","",""
"RandomSearch","3","4","60.2920701","Risk: ""UnauthorizedAccess"" | Risk: ""UnauthorizedAccess"" | Risk: ""UnauthorizedAccess"" | Risk: ""UnauthorizedAccess"" | Risk: ""OutsideEU"" | Risk: ""OutsideEU"" | Risk: ""OutsideEU"" | Risk: ""OutsideEU"" | ","UnauthorizedAccess: Adaptation_2_3 | OutsideEU: Adaptation_1_3 | UnauthorizedAccess: Adaptation_2_3 | OutsideEU: Adaptation_1_3 | OutsideEU: Adaptation_1_3 | UnauthorizedAccess: Adaptation_2_3 | UnauthorizedAccess: Adaptation_2_3 | OutsideEU: Adaptation_1_3 | ","9","9.460799999999999"
"BestFirstSearch","3","5","60.116674","Risk: ""UnauthorizedAccess"" | Risk: ""UnauthorizedAccess"" | Risk: ""UnauthorizedAccess"" | Risk: ""UnauthorizedAccess"" | Risk: ""OutsideEU"" | Risk: ""OutsideEU"" | Risk: ""OutsideEU"" | Risk: ""OutsideEU"" | ","OutsideEU: Adaptation_1_3 | OutsideEU: Adaptation_1_3 | OutsideEU: Adaptation_1_3 | UnauthorizedAccess: Adaptation_2_3 | UnauthorizedAccess: Adaptation_2_3 | UnauthorizedAccess: Adaptation_2_3 | UnauthorizedAccess: Adaptation_2_2 | ","7","7.233599999999999"
"DepthSearch","3","5","60.0313964","Risk: ""UnauthorizedAccess"" | Risk: ""UnauthorizedAccess"" | Risk: ""UnauthorizedAccess"" | Risk: ""UnauthorizedAccess"" | Risk: ""OutsideEU"" | Risk: ""OutsideEU"" | Risk: ""OutsideEU"" | Risk: ""OutsideEU"" | ","UnauthorizedAccess: Adaptation_2_3 | UnauthorizedAccess: Adaptation_2_2 | UnauthorizedAccess: Adaptation_2_2 | UnauthorizedAccess: Adaptation_2_2 | OutsideEU: Adaptation_1_3 | OutsideEU: Adaptation_1_3 | OutsideEU: Adaptation_1_3 | OutsideEU: Adaptation_1_3 | ","9","9.460799999999999"
"BreadthSearch","3","5","60.1335733","Risk: ""UnauthorizedAccess"" | Risk: ""UnauthorizedAccess"" | Risk: ""UnauthorizedAccess"" | Risk: ""UnauthorizedAccess"" | Risk: ""OutsideEU"" | Risk: ""OutsideEU"" | Risk: ""OutsideEU"" | Risk: ""OutsideEU"" | ","No possible adaptation found","",""
"RandomSearch","3","5","60.5524467","Risk: ""UnauthorizedAccess"" | Risk: ""UnauthorizedAccess"" | Risk: ""UnauthorizedAccess"" | Risk: ""UnauthorizedAccess"" | Risk: ""OutsideEU"" | Risk: ""OutsideEU"" | Risk: ""OutsideEU"" | Risk: ""OutsideEU"" | ","OutsideEU: Adaptation_1_3 | OutsideEU: Adaptation_1_3 | UnauthorizedAccess: Adaptation_2_3 | UnauthorizedAccess: Adaptation_2_3 | OutsideEU: Adaptation_1_3 | UnauthorizedAccess: Adaptation_2_3 | UnauthorizedAccess: Adaptation_2_2 | OutsideEU: Adaptation_1_3 | ","9","9.460799999999999"
"BestFirstSearch","3","6","60.054704","Risk: ""UnauthorizedAccess"" | Risk: ""UnauthorizedAccess"" | Risk: ""UnauthorizedAccess"" | Risk: ""UnauthorizedAccess"" | Risk: ""OutsideEU"" | Risk: ""OutsideEU"" | Risk: ""OutsideEU"" | Risk: ""OutsideEU"" | ","OutsideEU: Adaptation_1_3 | OutsideEU: Adaptation_1_3 | OutsideEU: Adaptation_1_3 | UnauthorizedAccess: Adaptation_2_3 | UnauthorizedAccess: Adaptation_2_3 | UnauthorizedAccess: Adaptation_2_3 | UnauthorizedAccess: Adaptation_2_2 | ","7","7.233599999999999"
"DepthSearch","3","6","60.0307007","Risk: ""UnauthorizedAccess"" | Risk: ""UnauthorizedAccess"" | Risk: ""UnauthorizedAccess"" | Risk: ""UnauthorizedAccess"" | Risk: ""OutsideEU"" | Risk: ""OutsideEU"" | Risk: ""OutsideEU"" | Risk: ""OutsideEU"" | ","UnauthorizedAccess: Adaptation_2_3 | UnauthorizedAccess: Adaptation_2_2 | UnauthorizedAccess: Adaptation_2_2 | UnauthorizedAccess: Adaptation_2_2 | OutsideEU: Adaptation_1_3 | OutsideEU: Adaptation_1_1 | OutsideEU: Adaptation_1_1 | OutsideEU: Adaptation_1_1 | ","3","2.7792"
"BreadthSearch","3","6","60.1779596","Risk: ""UnauthorizedAccess"" | Risk: ""UnauthorizedAccess"" | Risk: ""UnauthorizedAccess"" | Risk: ""UnauthorizedAccess"" | Risk: ""OutsideEU"" | Risk: ""OutsideEU"" | Risk: ""OutsideEU"" | Risk: ""OutsideEU"" | ","No possible adaptation found","",""
"RandomSearch","3","6","61.1553924","Risk: ""UnauthorizedAccess"" | Risk: ""UnauthorizedAccess"" | Risk: ""UnauthorizedAccess"" | Risk: ""UnauthorizedAccess"" | Risk: ""OutsideEU"" | Risk: ""OutsideEU"" | Risk: ""OutsideEU"" | Risk: ""OutsideEU"" | ","OutsideEU: Adaptation_1_3 | UnauthorizedAccess: Adaptation_2_3 | OutsideEU: Adaptation_1_3 | UnauthorizedAccess: Adaptation_2_3 | UnauthorizedAccess: Adaptation_2_2 | UnauthorizedAccess: Adaptation_2_2 | OutsideEU: Adaptation_1_3 | OutsideEU: Adaptation_1_3 | ","9","9.460799999999999"
"BestFirstSearch","3","7","60.0588735","Risk: ""UnauthorizedAccess"" | Risk: ""UnauthorizedAccess"" | Risk: ""UnauthorizedAccess"" | Risk: ""UnauthorizedAccess"" | Risk: ""OutsideEU"" | Risk: ""OutsideEU"" | Risk: ""OutsideEU"" | Risk: ""OutsideEU"" | ","OutsideEU: Adaptation_1_3 | OutsideEU: Adaptation_1_3 | OutsideEU: Adaptation_1_3 | UnauthorizedAccess: Adaptation_2_3 | UnauthorizedAccess: Adaptation_2_3 | UnauthorizedAccess: Adaptation_2_3 | UnauthorizedAccess: Adaptation_2_2 | ","7","7.233599999999999"
"DepthSearch","3","7","60.0324698","Risk: ""UnauthorizedAccess"" | Risk: ""UnauthorizedAccess"" | Risk: ""UnauthorizedAccess"" | Risk: ""UnauthorizedAccess"" | Risk: ""OutsideEU"" | Risk: ""OutsideEU"" | Risk: ""OutsideEU"" | Risk: ""OutsideEU"" | ","UnauthorizedAccess: Adaptation_2_3 | UnauthorizedAccess: Adaptation_2_3 | UnauthorizedAccess: Adaptation_2_3 | UnauthorizedAccess: Adaptation_2_3 | OutsideEU: Adaptation_1_3 | OutsideEU: Adaptation_1_3 | OutsideEU: Adaptation_1_3 | OutsideEU: Adaptation_1_3 | ","9","9.460799999999999"
"BreadthSearch","3","7","60.104449","Risk: ""UnauthorizedAccess"" | Risk: ""UnauthorizedAccess"" | Risk: ""UnauthorizedAccess"" | Risk: ""UnauthorizedAccess"" | Risk: ""OutsideEU"" | Risk: ""OutsideEU"" | Risk: ""OutsideEU"" | Risk: ""OutsideEU"" | ","No possible adaptation found","",""
"RandomSearch","3","7","60.0600086","Risk: ""UnauthorizedAccess"" | Risk: ""UnauthorizedAccess"" | Risk: ""UnauthorizedAccess"" | Risk: ""UnauthorizedAccess"" | Risk: ""OutsideEU"" | Risk: ""OutsideEU"" | Risk: ""OutsideEU"" | Risk: ""OutsideEU"" | ","OutsideEU: Adaptation_1_3 | UnauthorizedAccess: Adaptation_2_3 | UnauthorizedAccess: Adaptation_2_3 | UnauthorizedAccess: Adaptation_2_2 | OutsideEU: Adaptation_1_3 | OutsideEU: Adaptation_1_1 | UnauthorizedAccess: Adaptation_2_3 | OutsideEU: Adaptation_1_3 | ","7","7.233599999999999"
"BestFirstSearch","3","8","60.3723048","Risk: ""UnauthorizedAccess"" | Risk: ""UnauthorizedAccess"" | Risk: ""UnauthorizedAccess"" | Risk: ""UnauthorizedAccess"" | Risk: ""OutsideEU"" | Risk: ""OutsideEU"" | Risk: ""OutsideEU"" | Risk: ""OutsideEU"" | ","OutsideEU: Adaptation_1_3 | OutsideEU: Adaptation_1_3 | OutsideEU: Adaptation_1_3 | UnauthorizedAccess: Adaptation_2_3 | UnauthorizedAccess: Adaptation_2_3 | UnauthorizedAccess: Adaptation_2_3 | UnauthorizedAccess: Adaptation_2_2 | ","7","7.233599999999999"
"DepthSearch","3","8","60.0372972","Risk: ""UnauthorizedAccess"" | Risk: ""UnauthorizedAccess"" | Risk: ""UnauthorizedAccess"" | Risk: ""UnauthorizedAccess"" | Risk: ""OutsideEU"" | Risk: ""OutsideEU"" | Risk: ""OutsideEU"" | Risk: ""OutsideEU"" | ","UnauthorizedAccess: Adaptation_2_3 | UnauthorizedAccess: Adaptation_2_2 | UnauthorizedAccess: Adaptation_2_2 | UnauthorizedAccess: Adaptation_2_2 | OutsideEU: Adaptation_1_3 | OutsideEU: Adaptation_1_3 | OutsideEU: Adaptation_1_3 | OutsideEU: Adaptation_1_3 | ","9","9.460799999999999"
"BreadthSearch","3","8","60.3381902","Risk: ""UnauthorizedAccess"" | Risk: ""UnauthorizedAccess"" | Risk: ""UnauthorizedAccess"" | Risk: ""UnauthorizedAccess"" | Risk: ""OutsideEU"" | Risk: ""OutsideEU"" | Risk: ""OutsideEU"" | Risk: ""OutsideEU"" | ","No possible adaptation found","",""
"RandomSearch","3","8","60.0217986","Risk: ""UnauthorizedAccess"" | Risk: ""UnauthorizedAccess"" | Risk: ""UnauthorizedAccess"" | Risk: ""UnauthorizedAccess"" | Risk: ""OutsideEU"" | Risk: ""OutsideEU"" | Risk: ""OutsideEU"" | Risk: ""OutsideEU"" | ","UnauthorizedAccess: Adaptation_2_3 | OutsideEU: Adaptation_1_3 | OutsideEU: Adaptation_1_3 | OutsideEU: Adaptation_1_3 | UnauthorizedAccess: Adaptation_2_3 | UnauthorizedAccess: Adaptation_2_3 | UnauthorizedAccess: Adaptation_2_3 | OutsideEU: Adaptation_1_3 | ","9","9.460799999999999"
"BestFirstSearch","3","9","60.057662","Risk: ""UnauthorizedAccess"" | Risk: ""UnauthorizedAccess"" | Risk: ""UnauthorizedAccess"" | Risk: ""UnauthorizedAccess"" | Risk: ""OutsideEU"" | Risk: ""OutsideEU"" | Risk: ""OutsideEU"" | Risk: ""OutsideEU"" | ","OutsideEU: Adaptation_1_3 | OutsideEU: Adaptation_1_3 | OutsideEU: Adaptation_1_3 | UnauthorizedAccess: Adaptation_2_3 | UnauthorizedAccess: Adaptation_2_3 | UnauthorizedAccess: Adaptation_2_3 | UnauthorizedAccess: Adaptation_2_2 | ","7","7.233599999999999"
"DepthSearch","3","9","60.0984304","Risk: ""UnauthorizedAccess"" | Risk: ""UnauthorizedAccess"" | Risk: ""UnauthorizedAccess"" | Risk: ""UnauthorizedAccess"" | Risk: ""OutsideEU"" | Risk: ""OutsideEU"" | Risk: ""OutsideEU"" | Risk: ""OutsideEU"" | ","UnauthorizedAccess: Adaptation_2_3 | UnauthorizedAccess: Adaptation_2_3 | UnauthorizedAccess: Adaptation_2_3 | UnauthorizedAccess: Adaptation_2_3 | OutsideEU: Adaptation_1_3 | OutsideEU: Adaptation_1_3 | OutsideEU: Adaptation_1_3 | OutsideEU: Adaptation_1_3 | ","9","9.460799999999999"
"BreadthSearch","3","9","61.2250961","Risk: ""UnauthorizedAccess"" | Risk: ""UnauthorizedAccess"" | Risk: ""UnauthorizedAccess"" | Risk: ""UnauthorizedAccess"" | Risk: ""OutsideEU"" | Risk: ""OutsideEU"" | Risk: ""OutsideEU"" | Risk: ""OutsideEU"" | ","No possible adaptation found","",""
"RandomSearch","3","9","60.5109169","Risk: ""UnauthorizedAccess"" | Risk: ""UnauthorizedAccess"" | Risk: ""UnauthorizedAccess"" | Risk: ""UnauthorizedAccess"" | Risk: ""OutsideEU"" | Risk: ""OutsideEU"" | Risk: ""OutsideEU"" | Risk: ""OutsideEU"" | ","UnauthorizedAccess: Adaptation_2_3 | OutsideEU: Adaptation_1_3 | OutsideEU: Adaptation_1_3 | UnauthorizedAccess: Adaptation_2_3 | OutsideEU: Adaptation_1_3 | UnauthorizedAccess: Adaptation_2_2 | UnauthorizedAccess: Adaptation_2_3 | ","7","7.233599999999999"
"BestFirstSearch","10","0","60.0420792","Risk: ""UnauthorizedAccess"" | Risk: ""UnauthorizedAccess"" | Risk: ""UnauthorizedAccess"" | Risk: ""UnauthorizedAccess"" | Risk: ""UnauthorizedAccess"" | Risk: ""UnauthorizedAccess"" | Risk: ""UnauthorizedAccess"" | Risk: ""UnauthorizedAccess"" | Risk: ""UnauthorizedAccess"" | Risk: ""UnauthorizedAccess"" | Risk: ""UnauthorizedAccess"" | Risk: ""OutsideEU"" | Risk: ""OutsideEU"" | Risk: ""OutsideEU"" | Risk: ""OutsideEU"" | Risk: ""OutsideEU"" | Risk: ""OutsideEU"" | Risk: ""OutsideEU"" | Risk: ""OutsideEU"" | Risk: ""OutsideEU"" | Risk: ""OutsideEU"" | Risk: ""OutsideEU"" | ","OutsideEU: Adaptation_1_3 | OutsideEU: Adaptation_1_3 | OutsideEU: Adaptation_1_3 | UnauthorizedAccess: Adaptation_2_3 | UnauthorizedAccess: Adaptation_2_3 | UnauthorizedAccess: Adaptation_2_3 | UnauthorizedAccess: Adaptation_2_2 | UnauthorizedAccess: Adaptation_2_2 | UnauthorizedAccess: Adaptation_2_2 | UnauthorizedAccess: Adaptation_2_2 | UnauthorizedAccess: Adaptation_2_2 | UnauthorizedAccess: Adaptation_2_2 | UnauthorizedAccess: Adaptation_2_2 | UnauthorizedAccess: Adaptation_2_2 | ","7","7.233599999999999"
"DepthSearch","10","0","60.1017073","Risk: ""UnauthorizedAccess"" | Risk: ""UnauthorizedAccess"" | Risk: ""UnauthorizedAccess"" | Risk: ""UnauthorizedAccess"" | Risk: ""UnauthorizedAccess"" | Risk: ""UnauthorizedAccess"" | Risk: ""UnauthorizedAccess"" | Risk: ""UnauthorizedAccess"" | Risk: ""UnauthorizedAccess"" | Risk: ""UnauthorizedAccess"" | Risk: ""UnauthorizedAccess"" | Risk: ""OutsideEU"" | Risk: ""OutsideEU"" | Risk: ""OutsideEU"" | Risk: ""OutsideEU"" | Risk: ""OutsideEU"" | Risk: ""OutsideEU"" | Risk: ""OutsideEU"" | Risk: ""OutsideEU"" | Risk: ""OutsideEU"" | Risk: ""OutsideEU"" | Risk: ""OutsideEU"" | ","UnauthorizedAccess: Adaptation_2_3 | UnauthorizedAccess: Adaptation_2_2 | UnauthorizedAccess: Adaptation_2_2 | UnauthorizedAccess: Adaptation_2_2 | UnauthorizedAccess: Adaptation_2_2 | UnauthorizedAccess: Adaptation_2_2 | UnauthorizedAccess: Adaptation_2_2 | UnauthorizedAccess: Adaptation_2_2 | UnauthorizedAccess: Adaptation_2_2 | UnauthorizedAccess: Adaptation_2_2 | UnauthorizedAccess: Adaptation_2_2 | OutsideEU: Adaptation_1_3 | OutsideEU: Adaptation_1_3 | OutsideEU: Adaptation_1_3 | OutsideEU: Adaptation_1_3 | OutsideEU: Adaptation_1_3 | OutsideEU: Adaptation_1_3 | OutsideEU: Adaptation_1_3 | OutsideEU: Adaptation_1_3 | OutsideEU: Adaptation_1_3 | OutsideEU: Adaptation_1_3 | OutsideEU: Adaptation_1_3 | ","23","25.051199999999987"
"BreadthSearch","10","0","60.0258515","Risk: ""UnauthorizedAccess"" | Risk: ""UnauthorizedAccess"" | Risk: ""UnauthorizedAccess"" | Risk: ""UnauthorizedAccess"" | Risk: ""UnauthorizedAccess"" | Risk: ""UnauthorizedAccess"" | Risk: ""UnauthorizedAccess"" | Risk: ""UnauthorizedAccess"" | Risk: ""UnauthorizedAccess"" | Risk: ""UnauthorizedAccess"" | Risk: ""UnauthorizedAccess"" | Risk: ""OutsideEU"" | Risk: ""OutsideEU"" | Risk: ""OutsideEU"" | Risk: ""OutsideEU"" | Risk: ""OutsideEU"" | Risk: ""OutsideEU"" | Risk: ""OutsideEU"" | Risk: ""OutsideEU"" | Risk: ""OutsideEU"" | Risk: ""OutsideEU"" | Risk: ""OutsideEU"" | ","No possible adaptation found","",""
"RandomSearch","10","0","60.5415616","Risk: ""UnauthorizedAccess"" | Risk: ""UnauthorizedAccess"" | Risk: ""UnauthorizedAccess"" | Risk: ""UnauthorizedAccess"" | Risk: ""UnauthorizedAccess"" | Risk: ""UnauthorizedAccess"" | Risk: ""UnauthorizedAccess"" | Risk: ""UnauthorizedAccess"" | Risk: ""UnauthorizedAccess"" | Risk: ""UnauthorizedAccess"" | Risk: ""UnauthorizedAccess"" | Risk: ""OutsideEU"" | Risk: ""OutsideEU"" | Risk: ""OutsideEU"" | Risk: ""OutsideEU"" | Risk: ""OutsideEU"" | Risk: ""OutsideEU"" | Risk: ""OutsideEU"" | Risk: ""OutsideEU"" | Risk: ""OutsideEU"" | Risk: ""OutsideEU"" | Risk: ""OutsideEU"" | ","No possible adaptation found","",""
"BestFirstSearch","10","1","60.0690742","Risk: ""UnauthorizedAccess"" | Risk: ""UnauthorizedAccess"" | Risk: ""UnauthorizedAccess"" | Risk: ""UnauthorizedAccess"" | Risk: ""UnauthorizedAccess"" | Risk: ""UnauthorizedAccess"" | Risk: ""UnauthorizedAccess"" | Risk: ""UnauthorizedAccess"" | Risk: ""UnauthorizedAccess"" | Risk: ""UnauthorizedAccess"" | Risk: ""UnauthorizedAccess"" | Risk: ""OutsideEU"" | Risk: ""OutsideEU"" | Risk: ""OutsideEU"" | Risk: ""OutsideEU"" | Risk: ""OutsideEU"" | Risk: ""OutsideEU"" | Risk: ""OutsideEU"" | Risk: ""OutsideEU"" | Risk: ""OutsideEU"" | Risk: ""OutsideEU"" | Risk: ""OutsideEU"" | ","OutsideEU: Adaptation_1_3 | OutsideEU: Adaptation_1_3 | OutsideEU: Adaptation_1_3 | UnauthorizedAccess: Adaptation_2_3 | UnauthorizedAccess: Adaptation_2_3 | UnauthorizedAccess: Adaptation_2_3 | UnauthorizedAccess: Adaptation_2_2 | UnauthorizedAccess: Adaptation_2_2 | UnauthorizedAccess: Adaptation_2_2 | UnauthorizedAccess: Adaptation_2_2 | UnauthorizedAccess: Adaptation_2_2 | UnauthorizedAccess: Adaptation_2_2 | UnauthorizedAccess: Adaptation_2_2 | UnauthorizedAccess: Adaptation_2_2 | ","7","7.233599999999999"
"DepthSearch","10","1","60.1085643","Risk: ""UnauthorizedAccess"" | Risk: ""UnauthorizedAccess"" | Risk: ""UnauthorizedAccess"" | Risk: ""UnauthorizedAccess"" | Risk: ""UnauthorizedAccess"" | Risk: ""UnauthorizedAccess"" | Risk: ""UnauthorizedAccess"" | Risk: ""UnauthorizedAccess"" | Risk: ""UnauthorizedAccess"" | Risk: ""UnauthorizedAccess"" | Risk: ""UnauthorizedAccess"" | Risk: ""OutsideEU"" | Risk: ""OutsideEU"" | Risk: ""OutsideEU"" | Risk: ""OutsideEU"" | Risk: ""OutsideEU"" | Risk: ""OutsideEU"" | Risk: ""OutsideEU"" | Risk: ""OutsideEU"" | Risk: ""OutsideEU"" | Risk: ""OutsideEU"" | Risk: ""OutsideEU"" | ","UnauthorizedAccess: Adaptation_2_3 | UnauthorizedAccess: Adaptation_2_3 | UnauthorizedAccess: Adaptation_2_3 | UnauthorizedAccess: Adaptation_2_3 | UnauthorizedAccess: Adaptation_2_3 | UnauthorizedAccess: Adaptation_2_3 | UnauthorizedAccess: Adaptation_2_3 | UnauthorizedAccess: Adaptation_2_3 | UnauthorizedAccess: Adaptation_2_3 | UnauthorizedAccess: Adaptation_2_3 | UnauthorizedAccess: Adaptation_2_3 | OutsideEU: Adaptation_1_2 | OutsideEU: Adaptation_1_2 | OutsideEU: Adaptation_1_2 | OutsideEU: Adaptation_1_2 | OutsideEU: Adaptation_1_2 | OutsideEU: Adaptation_1_2 | OutsideEU: Adaptation_1_2 | OutsideEU: Adaptation_1_2 | OutsideEU: Adaptation_1_2 | OutsideEU: Adaptation_1_2 | OutsideEU: Adaptation_1_2 | ","23","26.726399999999984"
"BreadthSearch","10","1","60.0270378","Risk: ""UnauthorizedAccess"" | Risk: ""UnauthorizedAccess"" | Risk: ""UnauthorizedAccess"" | Risk: ""UnauthorizedAccess"" | Risk: ""UnauthorizedAccess"" | Risk: ""UnauthorizedAccess"" | Risk: ""UnauthorizedAccess"" | Risk: ""UnauthorizedAccess"" | Risk: ""UnauthorizedAccess"" | Risk: ""UnauthorizedAccess"" | Risk: ""UnauthorizedAccess"" | Risk: ""OutsideEU"" | Risk: ""OutsideEU"" | Risk: ""OutsideEU"" | Risk: ""OutsideEU"" | Risk: ""OutsideEU"" | Risk: ""OutsideEU"" | Risk: ""OutsideEU"" | Risk: ""OutsideEU"" | Risk: ""OutsideEU"" | Risk: ""OutsideEU"" | Risk: ""OutsideEU"" | ","No possible adaptation found","",""
"RandomSearch","10","1","60.3845948","Risk: ""UnauthorizedAccess"" | Risk: ""UnauthorizedAccess"" | Risk: ""UnauthorizedAccess"" | Risk: ""UnauthorizedAccess"" | Risk: ""UnauthorizedAccess"" | Risk: ""UnauthorizedAccess"" | Risk: ""UnauthorizedAccess"" | Risk: ""UnauthorizedAccess"" | Risk: ""UnauthorizedAccess"" | Risk: ""UnauthorizedAccess"" | Risk: ""UnauthorizedAccess"" | Risk: ""OutsideEU"" | Risk: ""OutsideEU"" | Risk: ""OutsideEU"" | Risk: ""OutsideEU"" | Risk: ""OutsideEU"" | Risk: ""OutsideEU"" | Risk: ""OutsideEU"" | Risk: ""OutsideEU"" | Risk: ""OutsideEU"" | Risk: ""OutsideEU"" | Risk: ""OutsideEU"" | ","No possible adaptation found","",""
"BestFirstSearch","10","2","60.0781432","Risk: ""UnauthorizedAccess"" | Risk: ""UnauthorizedAccess"" | Risk: ""UnauthorizedAccess"" | Risk: ""UnauthorizedAccess"" | Risk: ""UnauthorizedAccess"" | Risk: ""UnauthorizedAccess"" | Risk: ""UnauthorizedAccess"" | Risk: ""UnauthorizedAccess"" | Risk: ""UnauthorizedAccess"" | Risk: ""UnauthorizedAccess"" | Risk: ""UnauthorizedAccess"" | Risk: ""OutsideEU"" | Risk: ""OutsideEU"" | Risk: ""OutsideEU"" | Risk: ""OutsideEU"" | Risk: ""OutsideEU"" | Risk: ""OutsideEU"" | Risk: ""OutsideEU"" | Risk: ""OutsideEU"" | Risk: ""OutsideEU"" | Risk: ""OutsideEU"" | Risk: ""OutsideEU"" | ","OutsideEU: Adaptation_1_3 | OutsideEU: Adaptation_1_3 | OutsideEU: Adaptation_1_3 | UnauthorizedAccess: Adaptation_2_3 | UnauthorizedAccess: Adaptation_2_3 | UnauthorizedAccess: Adaptation_2_3 | UnauthorizedAccess: Adaptation_2_2 | UnauthorizedAccess: Adaptation_2_2 | UnauthorizedAccess: Adaptation_2_2 | UnauthorizedAccess: Adaptation_2_2 | UnauthorizedAccess: Adaptation_2_2 | UnauthorizedAccess: Adaptation_2_2 | UnauthorizedAccess: Adaptation_2_2 | UnauthorizedAccess: Adaptation_2_2 | ","7","7.233599999999999"
"DepthSearch","10","2","60.1806591","Risk: ""UnauthorizedAccess"" | Risk: ""UnauthorizedAccess"" | Risk: ""UnauthorizedAccess"" | Risk: ""UnauthorizedAccess"" | Risk: ""UnauthorizedAccess"" | Risk: ""UnauthorizedAccess"" | Risk: ""UnauthorizedAccess"" | Risk: ""UnauthorizedAccess"" | Risk: ""UnauthorizedAccess"" | Risk: ""UnauthorizedAccess"" | Risk: ""UnauthorizedAccess"" | Risk: ""OutsideEU"" | Risk: ""OutsideEU"" | Risk: ""OutsideEU"" | Risk: ""OutsideEU"" | Risk: ""OutsideEU"" | Risk: ""OutsideEU"" | Risk: ""OutsideEU"" | Risk: ""OutsideEU"" | Risk: ""OutsideEU"" | Risk: ""OutsideEU"" | Risk: ""OutsideEU"" | ","UnauthorizedAccess: Adaptation_2_3 | UnauthorizedAccess: Adaptation_2_2 | UnauthorizedAccess: Adaptation_2_2 | UnauthorizedAccess: Adaptation_2_2 | UnauthorizedAccess: Adaptation_2_2 | UnauthorizedAccess: Adaptation_2_2 | UnauthorizedAccess: Adaptation_2_2 | UnauthorizedAccess: Adaptation_2_2 | UnauthorizedAccess: Adaptation_2_2 | UnauthorizedAccess: Adaptation_2_2 | UnauthorizedAccess: Adaptation_2_2 | OutsideEU: Adaptation_1_2 | OutsideEU: Adaptation_1_2 | OutsideEU: Adaptation_1_2 | OutsideEU: Adaptation_1_2 | OutsideEU: Adaptation_1_2 | OutsideEU: Adaptation_1_2 | OutsideEU: Adaptation_1_2 | OutsideEU: Adaptation_1_2 | OutsideEU: Adaptation_1_2 | OutsideEU: Adaptation_1_2 | OutsideEU: Adaptation_1_2 | ","23","26.726399999999984"
"BreadthSearch","10","2","61.2826322","Risk: ""UnauthorizedAccess"" | Risk: ""UnauthorizedAccess"" | Risk: ""UnauthorizedAccess"" | Risk: ""UnauthorizedAccess"" | Risk: ""UnauthorizedAccess"" | Risk: ""UnauthorizedAccess"" | Risk: ""UnauthorizedAccess"" | Risk: ""UnauthorizedAccess"" | Risk: ""UnauthorizedAccess"" | Risk: ""UnauthorizedAccess"" | Risk: ""UnauthorizedAccess"" | Risk: ""OutsideEU"" | Risk: ""OutsideEU"" | Risk: ""OutsideEU"" | Risk: ""OutsideEU"" | Risk: ""OutsideEU"" | Risk: ""OutsideEU"" | Risk: ""OutsideEU"" | Risk: ""OutsideEU"" | Risk: ""OutsideEU"" | Risk: ""OutsideEU"" | Risk: ""OutsideEU"" | ","No possible adaptation found","",""
"RandomSearch","10","2","61.0762483","Risk: ""UnauthorizedAccess"" | Risk: ""UnauthorizedAccess"" | Risk: ""UnauthorizedAccess"" | Risk: ""UnauthorizedAccess"" | Risk: ""UnauthorizedAccess"" | Risk: ""UnauthorizedAccess"" | Risk: ""UnauthorizedAccess"" | Risk: ""UnauthorizedAccess"" | Risk: ""UnauthorizedAccess"" | Risk: ""UnauthorizedAccess"" | Risk: ""UnauthorizedAccess"" | Risk: ""OutsideEU"" | Risk: ""OutsideEU"" | Risk: ""OutsideEU"" | Risk: ""OutsideEU"" | Risk: ""OutsideEU"" | Risk: ""OutsideEU"" | Risk: ""OutsideEU"" | Risk: ""OutsideEU"" | Risk: ""OutsideEU"" | Risk: ""OutsideEU"" | Risk: ""OutsideEU"" | ","No possible adaptation found","",""
"BestFirstSearch","10","3","60.1454377","Risk: ""UnauthorizedAccess"" | Risk: ""UnauthorizedAccess"" | Risk: ""UnauthorizedAccess"" | Risk: ""UnauthorizedAccess"" | Risk: ""UnauthorizedAccess"" | Risk: ""UnauthorizedAccess"" | Risk: ""UnauthorizedAccess"" | Risk: ""UnauthorizedAccess"" | Risk: ""UnauthorizedAccess"" | Risk: ""UnauthorizedAccess"" | Risk: ""UnauthorizedAccess"" | Risk: ""OutsideEU"" | Risk: ""OutsideEU"" | Risk: ""OutsideEU"" | Risk: ""OutsideEU"" | Risk: ""OutsideEU"" | Risk: ""OutsideEU"" | Risk: ""OutsideEU"" | Risk: ""OutsideEU"" | Risk: ""OutsideEU"" | Risk: ""OutsideEU"" | Risk: ""OutsideEU"" | ","OutsideEU: Adaptation_1_3 | OutsideEU: Adaptation_1_3 | OutsideEU: Adaptation_1_3 | UnauthorizedAccess: Adaptation_2_3 | UnauthorizedAccess: Adaptation_2_3 | UnauthorizedAccess: Adaptation_2_3 | UnauthorizedAccess: Adaptation_2_2 | UnauthorizedAccess: Adaptation_2_2 | UnauthorizedAccess: Adaptation_2_2 | UnauthorizedAccess: Adaptation_2_2 | UnauthorizedAccess: Adaptation_2_2 | UnauthorizedAccess: Adaptation_2_2 | UnauthorizedAccess: Adaptation_2_2 | UnauthorizedAccess: Adaptation_2_2 | ","7","7.233599999999999"
"DepthSearch","10","3","60.1710989","Risk: ""UnauthorizedAccess"" | Risk: ""UnauthorizedAccess"" | Risk: ""UnauthorizedAccess"" | Risk: ""UnauthorizedAccess"" | Risk: ""UnauthorizedAccess"" | Risk: ""UnauthorizedAccess"" | Risk: ""UnauthorizedAccess"" | Risk: ""UnauthorizedAccess"" | Risk: ""UnauthorizedAccess"" | Risk: ""UnauthorizedAccess"" | Risk: ""UnauthorizedAccess"" | Risk: ""OutsideEU"" | Risk: ""OutsideEU"" | Risk: ""OutsideEU"" | Risk: ""OutsideEU"" | Risk: ""OutsideEU"" | Risk: ""OutsideEU"" | Risk: ""OutsideEU"" | Risk: ""OutsideEU"" | Risk: ""OutsideEU"" | Risk: ""OutsideEU"" | Risk: ""OutsideEU"" | ","UnauthorizedAccess: Adaptation_2_3 | UnauthorizedAccess: Adaptation_2_3 | UnauthorizedAccess: Adaptation_2_3 | UnauthorizedAccess: Adaptation_2_3 | UnauthorizedAccess: Adaptation_2_3 | UnauthorizedAccess: Adaptation_2_3 | UnauthorizedAccess: Adaptation_2_3 | UnauthorizedAccess: Adaptation_2_3 | UnauthorizedAccess: Adaptation_2_3 | UnauthorizedAccess: Adaptation_2_3 | UnauthorizedAccess: Adaptation_2_3 | OutsideEU: Adaptation_1_1 | OutsideEU: Adaptation_1_1 | OutsideEU: Adaptation_1_1 | OutsideEU: Adaptation_1_1 | OutsideEU: Adaptation_1_1 | OutsideEU: Adaptation_1_1 | OutsideEU: Adaptation_1_1 | OutsideEU: Adaptation_1_1 | OutsideEU: Adaptation_1_1 | OutsideEU: Adaptation_1_1 | OutsideEU: Adaptation_1_1 | ","2","2.2272"
"BreadthSearch","10","3","60.2286594","Risk: ""UnauthorizedAccess"" | Risk: ""UnauthorizedAccess"" | Risk: ""UnauthorizedAccess"" | Risk: ""UnauthorizedAccess"" | Risk: ""UnauthorizedAccess"" | Risk: ""UnauthorizedAccess"" | Risk: ""UnauthorizedAccess"" | Risk: ""UnauthorizedAccess"" | Risk: ""UnauthorizedAccess"" | Risk: ""UnauthorizedAccess"" | Risk: ""UnauthorizedAccess"" | Risk: ""OutsideEU"" | Risk: ""OutsideEU"" | Risk: ""OutsideEU"" | Risk: ""OutsideEU"" | Risk: ""OutsideEU"" | Risk: ""OutsideEU"" | Risk: ""OutsideEU"" | Risk: ""OutsideEU"" | Risk: ""OutsideEU"" | Risk: ""OutsideEU"" | Risk: ""OutsideEU"" | ","No possible adaptation found","",""
"RandomSearch","10","3","60.0274672","Risk: ""UnauthorizedAccess"" | Risk: ""UnauthorizedAccess"" | Risk: ""UnauthorizedAccess"" | Risk: ""UnauthorizedAccess"" | Risk: ""UnauthorizedAccess"" | Risk: ""UnauthorizedAccess"" | Risk: ""UnauthorizedAccess"" | Risk: ""UnauthorizedAccess"" | Risk: ""UnauthorizedAccess"" | Risk: ""UnauthorizedAccess"" | Risk: ""UnauthorizedAccess"" | Risk: ""OutsideEU"" | Risk: ""OutsideEU"" | Risk: ""OutsideEU"" | Risk: ""OutsideEU"" | Risk: ""OutsideEU"" | Risk: ""OutsideEU"" | Risk: ""OutsideEU"" | Risk: ""OutsideEU"" | Risk: ""OutsideEU"" | Risk: ""OutsideEU"" | Risk: ""OutsideEU"" | ","No possible adaptation found","",""
"BestFirstSearch","10","4","60.0848679","Risk: ""UnauthorizedAccess"" | Risk: ""UnauthorizedAccess"" | Risk: ""UnauthorizedAccess"" | Risk: ""UnauthorizedAccess"" | Risk: ""UnauthorizedAccess"" | Risk: ""UnauthorizedAccess"" | Risk: ""UnauthorizedAccess"" | Risk: ""UnauthorizedAccess"" | Risk: ""UnauthorizedAccess"" | Risk: ""UnauthorizedAccess"" | Risk: ""UnauthorizedAccess"" | Risk: ""OutsideEU"" | Risk: ""OutsideEU"" | Risk: ""OutsideEU"" | Risk: ""OutsideEU"" | Risk: ""OutsideEU"" | Risk: ""OutsideEU"" | Risk: ""OutsideEU"" | Risk: ""OutsideEU"" | Risk: ""OutsideEU"" | Risk: ""OutsideEU"" | Risk: ""OutsideEU"" | ","OutsideEU: Adaptation_1_3 | OutsideEU: Adaptation_1_3 | OutsideEU: Adaptation_1_3 | UnauthorizedAccess: Adaptation_2_3 | UnauthorizedAccess: Adaptation_2_3 | UnauthorizedAccess: Adaptation_2_3 | UnauthorizedAccess: Adaptation_2_2 | UnauthorizedAccess: Adaptation_2_2 | UnauthorizedAccess: Adaptation_2_2 | UnauthorizedAccess: Adaptation_2_2 | UnauthorizedAccess: Adaptation_2_2 | UnauthorizedAccess: Adaptation_2_2 | UnauthorizedAccess: Adaptation_2_2 | UnauthorizedAccess: Adaptation_2_2 | ","7","7.233599999999999"
"DepthSearch","10","4","60.0993906","Risk: ""UnauthorizedAccess"" | Risk: ""UnauthorizedAccess"" | Risk: ""UnauthorizedAccess"" | Risk: ""UnauthorizedAccess"" | Risk: ""UnauthorizedAccess"" | Risk: ""UnauthorizedAccess"" | Risk: ""UnauthorizedAccess"" | Risk: ""UnauthorizedAccess"" | Risk: ""UnauthorizedAccess"" | Risk: ""UnauthorizedAccess"" | Risk: ""UnauthorizedAccess"" | Risk: ""OutsideEU"" | Risk: ""OutsideEU"" | Risk: ""OutsideEU"" | Risk: ""OutsideEU"" | Risk: ""OutsideEU"" | Risk: ""OutsideEU"" | Risk: ""OutsideEU"" | Risk: ""OutsideEU"" | Risk: ""OutsideEU"" | Risk: ""OutsideEU"" | Risk: ""OutsideEU"" | ","UnauthorizedAccess: Adaptation_2_3 | UnauthorizedAccess: Adaptation_2_3 | UnauthorizedAccess: Adaptation_2_3 | UnauthorizedAccess: Adaptation_2_3 | UnauthorizedAccess: Adaptation_2_3 | UnauthorizedAccess: Adaptation_2_3 | UnauthorizedAccess: Adaptation_2_3 | UnauthorizedAccess: Adaptation_2_3 | UnauthorizedAccess: Adaptation_2_3 | UnauthorizedAccess: Adaptation_2_3 | UnauthorizedAccess: Adaptation_2_3 | OutsideEU: Adaptation_1_2 | OutsideEU: Adaptation_1_2 | OutsideEU: Adaptation_1_2 | OutsideEU: Adaptation_1_2 | OutsideEU: Adaptation_1_2 | OutsideEU: Adaptation_1_2 | OutsideEU: Adaptation_1_2 | OutsideEU: Adaptation_1_2 | OutsideEU: Adaptation_1_2 | OutsideEU: Adaptation_1_2 | OutsideEU: Adaptation_1_2 | ","23","26.726399999999984"
"BreadthSearch","10","4","60.8742662","Risk: ""UnauthorizedAccess"" | Risk: ""UnauthorizedAccess"" | Risk: ""UnauthorizedAccess"" | Risk: ""UnauthorizedAccess"" | Risk: ""UnauthorizedAccess"" | Risk: ""UnauthorizedAccess"" | Risk: ""UnauthorizedAccess"" | Risk: ""UnauthorizedAccess"" | Risk: ""UnauthorizedAccess"" | Risk: ""UnauthorizedAccess"" | Risk: ""UnauthorizedAccess"" | Risk: ""OutsideEU"" | Risk: ""OutsideEU"" | Risk: ""OutsideEU"" | Risk: ""OutsideEU"" | Risk: ""OutsideEU"" | Risk: ""OutsideEU"" | Risk: ""OutsideEU"" | Risk: ""OutsideEU"" | Risk: ""OutsideEU"" | Risk: ""OutsideEU"" | Risk: ""OutsideEU"" | ","No possible adaptation found","",""
"RandomSearch","10","4","60.0251193","Risk: ""UnauthorizedAccess"" | Risk: ""UnauthorizedAccess"" | Risk: ""UnauthorizedAccess"" | Risk: ""UnauthorizedAccess"" | Risk: ""UnauthorizedAccess"" | Risk: ""UnauthorizedAccess"" | Risk: ""UnauthorizedAccess"" | Risk: ""UnauthorizedAccess"" | Risk: ""UnauthorizedAccess"" | Risk: ""UnauthorizedAccess"" | Risk: ""UnauthorizedAccess"" | Risk: ""OutsideEU"" | Risk: ""OutsideEU"" | Risk: ""OutsideEU"" | Risk: ""OutsideEU"" | Risk: ""OutsideEU"" | Risk: ""OutsideEU"" | Risk: ""OutsideEU"" | Risk: ""OutsideEU"" | Risk: ""OutsideEU"" | Risk: ""OutsideEU"" | Risk: ""OutsideEU"" | ","No possible adaptation found","",""
"BestFirstSearch","10","5","60.0559619","Risk: ""UnauthorizedAccess"" | Risk: ""UnauthorizedAccess"" | Risk: ""UnauthorizedAccess"" | Risk: ""UnauthorizedAccess"" | Risk: ""UnauthorizedAccess"" | Risk: ""UnauthorizedAccess"" | Risk: ""UnauthorizedAccess"" | Risk: ""UnauthorizedAccess"" | Risk: ""UnauthorizedAccess"" | Risk: ""UnauthorizedAccess"" | Risk: ""UnauthorizedAccess"" | Risk: ""OutsideEU"" | Risk: ""OutsideEU"" | Risk: ""OutsideEU"" | Risk: ""OutsideEU"" | Risk: ""OutsideEU"" | Risk: ""OutsideEU"" | Risk: ""OutsideEU"" | Risk: ""OutsideEU"" | Risk: ""OutsideEU"" | Risk: ""OutsideEU"" | Risk: ""OutsideEU"" | ","OutsideEU: Adaptation_1_3 | OutsideEU: Adaptation_1_3 | OutsideEU: Adaptation_1_3 | UnauthorizedAccess: Adaptation_2_3 | UnauthorizedAccess: Adaptation_2_3 | UnauthorizedAccess: Adaptation_2_3 | UnauthorizedAccess: Adaptation_2_2 | UnauthorizedAccess: Adaptation_2_2 | UnauthorizedAccess: Adaptation_2_2 | UnauthorizedAccess: Adaptation_2_2 | UnauthorizedAccess: Adaptation_2_2 | UnauthorizedAccess: Adaptation_2_2 | UnauthorizedAccess: Adaptation_2_2 | UnauthorizedAccess: Adaptation_2_2 | ","7","7.233599999999999"
"DepthSearch","10","5","60.0719233","Risk: ""UnauthorizedAccess"" | Risk: ""UnauthorizedAccess"" | Risk: ""UnauthorizedAccess"" | Risk: ""UnauthorizedAccess"" | Risk: ""UnauthorizedAccess"" | Risk: ""UnauthorizedAccess"" | Risk: ""UnauthorizedAccess"" | Risk: ""UnauthorizedAccess"" | Risk: ""UnauthorizedAccess"" | Risk: ""UnauthorizedAccess"" | Risk: ""UnauthorizedAccess"" | Risk: ""OutsideEU"" | Risk: ""OutsideEU"" | Risk: ""OutsideEU"" | Risk: ""OutsideEU"" | Risk: ""OutsideEU"" | Risk: ""OutsideEU"" | Risk: ""OutsideEU"" | Risk: ""OutsideEU"" | Risk: ""OutsideEU"" | Risk: ""OutsideEU"" | Risk: ""OutsideEU"" | ","UnauthorizedAccess: Adaptation_2_3 | UnauthorizedAccess: Adaptation_2_3 | UnauthorizedAccess: Adaptation_2_3 | UnauthorizedAccess: Adaptation_2_3 | UnauthorizedAccess: Adaptation_2_3 | UnauthorizedAccess: Adaptation_2_3 | UnauthorizedAccess: Adaptation_2_3 | UnauthorizedAccess: Adaptation_2_3 | UnauthorizedAccess: Adaptation_2_3 | UnauthorizedAccess: Adaptation_2_3 | UnauthorizedAccess: Adaptation_2_3 | OutsideEU: Adaptation_1_1 | OutsideEU: Adaptation_1_1 | OutsideEU: Adaptation_1_1 | OutsideEU: Adaptation_1_1 | OutsideEU: Adaptation_1_1 | OutsideEU: Adaptation_1_1 | OutsideEU: Adaptation_1_1 | OutsideEU: Adaptation_1_1 | OutsideEU: Adaptation_1_1 | OutsideEU: Adaptation_1_1 | OutsideEU: Adaptation_1_1 | ","2","2.2272"
"BreadthSearch","10","5","61.1304189","Risk: ""UnauthorizedAccess"" | Risk: ""UnauthorizedAccess"" | Risk: ""UnauthorizedAccess"" | Risk: ""UnauthorizedAccess"" | Risk: ""UnauthorizedAccess"" | Risk: ""UnauthorizedAccess"" | Risk: ""UnauthorizedAccess"" | Risk: ""UnauthorizedAccess"" | Risk: ""UnauthorizedAccess"" | Risk: ""UnauthorizedAccess"" | Risk: ""UnauthorizedAccess"" | Risk: ""OutsideEU"" | Risk: ""OutsideEU"" | Risk: ""OutsideEU"" | Risk: ""OutsideEU"" | Risk: ""OutsideEU"" | Risk: ""OutsideEU"" | Risk: ""OutsideEU"" | Risk: ""OutsideEU"" | Risk: ""OutsideEU"" | Risk: ""OutsideEU"" | Risk: ""OutsideEU"" | ","No possible adaptation found","",""
"RandomSearch","10","5","60.033656","Risk: ""UnauthorizedAccess"" | Risk: ""UnauthorizedAccess"" | Risk: ""UnauthorizedAccess"" | Risk: ""UnauthorizedAccess"" | Risk: ""UnauthorizedAccess"" | Risk: ""UnauthorizedAccess"" | Risk: ""UnauthorizedAccess"" | Risk: ""UnauthorizedAccess"" | Risk: ""UnauthorizedAccess"" | Risk: ""UnauthorizedAccess"" | Risk: ""UnauthorizedAccess"" | Risk: ""OutsideEU"" | Risk: ""OutsideEU"" | Risk: ""OutsideEU"" | Risk: ""OutsideEU"" | Risk: ""OutsideEU"" | Risk: ""OutsideEU"" | Risk: ""OutsideEU"" | Risk: ""OutsideEU"" | Risk: ""OutsideEU"" | Risk: ""OutsideEU"" | Risk: ""OutsideEU"" | ","No possible adaptation found","",""
"BestFirstSearch","10","6","60.0417082","Risk: ""UnauthorizedAccess"" | Risk: ""UnauthorizedAccess"" | Risk: ""UnauthorizedAccess"" | Risk: ""UnauthorizedAccess"" | Risk: ""UnauthorizedAccess"" | Risk: ""UnauthorizedAccess"" | Risk: ""UnauthorizedAccess"" | Risk: ""UnauthorizedAccess"" | Risk: ""UnauthorizedAccess"" | Risk: ""UnauthorizedAccess"" | Risk: ""UnauthorizedAccess"" | Risk: ""OutsideEU"" | Risk: ""OutsideEU"" | Risk: ""OutsideEU"" | Risk: ""OutsideEU"" | Risk: ""OutsideEU"" | Risk: ""OutsideEU"" | Risk: ""OutsideEU"" | Risk: ""OutsideEU"" | Risk: ""OutsideEU"" | Risk: ""OutsideEU"" | Risk: ""OutsideEU"" | ","OutsideEU: Adaptation_1_3 | OutsideEU: Adaptation_1_3 | OutsideEU: Adaptation_1_3 | UnauthorizedAccess: Adaptation_2_3 | UnauthorizedAccess: Adaptation_2_3 | UnauthorizedAccess: Adaptation_2_3 | UnauthorizedAccess: Adaptation_2_2 | UnauthorizedAccess: Adaptation_2_2 | UnauthorizedAccess: Adaptation_2_2 | UnauthorizedAccess: Adaptation_2_2 | UnauthorizedAccess: Adaptation_2_2 | UnauthorizedAccess: Adaptation_2_2 | UnauthorizedAccess: Adaptation_2_2 | UnauthorizedAccess: Adaptation_2_2 | ","7","7.233599999999999"
"DepthSearch","10","6","60.1016099","Risk: ""UnauthorizedAccess"" | Risk: ""UnauthorizedAccess"" | Risk: ""UnauthorizedAccess"" | Risk: ""UnauthorizedAccess"" | Risk: ""UnauthorizedAccess"" | Risk: ""UnauthorizedAccess"" | Risk: ""UnauthorizedAccess"" | Risk: ""UnauthorizedAccess"" | Risk: ""UnauthorizedAccess"" | Risk: ""UnauthorizedAccess"" | Risk: ""UnauthorizedAccess"" | Risk: ""OutsideEU"" | Risk: ""OutsideEU"" | Risk: ""OutsideEU"" | Risk: ""OutsideEU"" | Risk: ""OutsideEU"" | Risk: ""OutsideEU"" | Risk: ""OutsideEU"" | Risk: ""OutsideEU"" | Risk: ""OutsideEU"" | Risk: ""OutsideEU"" | Risk: ""OutsideEU"" | ","UnauthorizedAccess: Adaptation_2_3 | UnauthorizedAccess: Adaptation_2_2 | UnauthorizedAccess: Adaptation_2_2 | UnauthorizedAccess: Adaptation_2_2 | UnauthorizedAccess: Adaptation_2_2 | UnauthorizedAccess: Adaptation_2_2 | UnauthorizedAccess: Adaptation_2_2 | UnauthorizedAccess: Adaptation_2_2 | UnauthorizedAccess: Adaptation_2_2 | UnauthorizedAccess: Adaptation_2_2 | UnauthorizedAccess: Adaptation_2_2 | OutsideEU: Adaptation_1_2 | OutsideEU: Adaptation_1_2 | OutsideEU: Adaptation_1_2 | OutsideEU: Adaptation_1_2 | OutsideEU: Adaptation_1_2 | OutsideEU: Adaptation_1_2 | OutsideEU: Adaptation_1_2 | OutsideEU: Adaptation_1_2 | OutsideEU: Adaptation_1_2 | OutsideEU: Adaptation_1_2 | OutsideEU: Adaptation_1_2 | ","23","26.726399999999984"
"BreadthSearch","10","6","61.3127275","Risk: ""UnauthorizedAccess"" | Risk: ""UnauthorizedAccess"" | Risk: ""UnauthorizedAccess"" | Risk: ""UnauthorizedAccess"" | Risk: ""UnauthorizedAccess"" | Risk: ""UnauthorizedAccess"" | Risk: ""UnauthorizedAccess"" | Risk: ""UnauthorizedAccess"" | Risk: ""UnauthorizedAccess"" | Risk: ""UnauthorizedAccess"" | Risk: ""UnauthorizedAccess"" | Risk: ""OutsideEU"" | Risk: ""OutsideEU"" | Risk: ""OutsideEU"" | Risk: ""OutsideEU"" | Risk: ""OutsideEU"" | Risk: ""OutsideEU"" | Risk: ""OutsideEU"" | Risk: ""OutsideEU"" | Risk: ""OutsideEU"" | Risk: ""OutsideEU"" | Risk: ""OutsideEU"" | ","No possible adaptation found","",""
"RandomSearch","10","6","60.1552579","Risk: ""UnauthorizedAccess"" | Risk: ""UnauthorizedAccess"" | Risk: ""UnauthorizedAccess"" | Risk: ""UnauthorizedAccess"" | Risk: ""UnauthorizedAccess"" | Risk: ""UnauthorizedAccess"" | Risk: ""UnauthorizedAccess"" | Risk: ""UnauthorizedAccess"" | Risk: ""UnauthorizedAccess"" | Risk: ""UnauthorizedAccess"" | Risk: ""UnauthorizedAccess"" | Risk: ""OutsideEU"" | Risk: ""OutsideEU"" | Risk: ""OutsideEU"" | Risk: ""OutsideEU"" | Risk: ""OutsideEU"" | Risk: ""OutsideEU"" | Risk: ""OutsideEU"" | Risk: ""OutsideEU"" | Risk: ""OutsideEU"" | Risk: ""OutsideEU"" | Risk: ""OutsideEU"" | ","No possible adaptation found","",""
"BestFirstSearch","10","7","60.0690128","Risk: ""UnauthorizedAccess"" | Risk: ""UnauthorizedAccess"" | Risk: ""UnauthorizedAccess"" | Risk: ""UnauthorizedAccess"" | Risk: ""UnauthorizedAccess"" | Risk: ""UnauthorizedAccess"" | Risk: ""UnauthorizedAccess"" | Risk: ""UnauthorizedAccess"" | Risk: ""UnauthorizedAccess"" | Risk: ""UnauthorizedAccess"" | Risk: ""UnauthorizedAccess"" | Risk: ""OutsideEU"" | Risk: ""OutsideEU"" | Risk: ""OutsideEU"" | Risk: ""OutsideEU"" | Risk: ""OutsideEU"" | Risk: ""OutsideEU"" | Risk: ""OutsideEU"" | Risk: ""OutsideEU"" | Risk: ""OutsideEU"" | Risk: ""OutsideEU"" | Risk: ""OutsideEU"" | ","OutsideEU: Adaptation_1_3 | OutsideEU: Adaptation_1_3 | OutsideEU: Adaptation_1_3 | UnauthorizedAccess: Adaptation_2_3 | UnauthorizedAccess: Adaptation_2_3 | UnauthorizedAccess: Adaptation_2_3 | UnauthorizedAccess: Adaptation_2_2 | UnauthorizedAccess: Adaptation_2_2 | UnauthorizedAccess: Adaptation_2_2 | UnauthorizedAccess: Adaptation_2_2 | UnauthorizedAccess: Adaptation_2_2 | UnauthorizedAccess: Adaptation_2_2 | UnauthorizedAccess: Adaptation_2_2 | UnauthorizedAccess: Adaptation_2_2 | ","7","7.233599999999999"
"DepthSearch","10","7","60.1460443","Risk: ""UnauthorizedAccess"" | Risk: ""UnauthorizedAccess"" | Risk: ""UnauthorizedAccess"" | Risk: ""UnauthorizedAccess"" | Risk: ""UnauthorizedAccess"" | Risk: ""UnauthorizedAccess"" | Risk: ""UnauthorizedAccess"" | Risk: ""UnauthorizedAccess"" | Risk: ""UnauthorizedAccess"" | Risk: ""UnauthorizedAccess"" | Risk: ""UnauthorizedAccess"" | Risk: ""OutsideEU"" | Risk: ""OutsideEU"" | Risk: ""OutsideEU"" | Risk: ""OutsideEU"" | Risk: ""OutsideEU"" | Risk: ""OutsideEU"" | Risk: ""OutsideEU"" | Risk: ""OutsideEU"" | Risk: ""OutsideEU"" | Risk: ""OutsideEU"" | Risk: ""OutsideEU"" | ","UnauthorizedAccess: Adaptation_2_3 | UnauthorizedAccess: Adaptation_2_2 | UnauthorizedAccess: Adaptation_2_2 | UnauthorizedAccess: Adaptation_2_2 | UnauthorizedAccess: Adaptation_2_2 | UnauthorizedAccess: Adaptation_2_2 | UnauthorizedAccess: Adaptation_2_2 | UnauthorizedAccess: Adaptation_2_2 | UnauthorizedAccess: Adaptation_2_2 | UnauthorizedAccess: Adaptation_2_2 | UnauthorizedAccess: Adaptation_2_2 | OutsideEU: Adaptation_1_3 | OutsideEU: Adaptation_1_3 | OutsideEU: Adaptation_1_3 | OutsideEU: Adaptation_1_3 | OutsideEU: Adaptation_1_3 | OutsideEU: Adaptation_1_3 | OutsideEU: Adaptation_1_3 | OutsideEU: Adaptation_1_3 | OutsideEU: Adaptation_1_3 | OutsideEU: Adaptation_1_3 | OutsideEU: Adaptation_1_3 | ","23","25.051199999999987"
"BreadthSearch","10","7","60.0227451","Risk: ""UnauthorizedAccess"" | Risk: ""UnauthorizedAccess"" | Risk: ""UnauthorizedAccess"" | Risk: ""UnauthorizedAccess"" | Risk: ""UnauthorizedAccess"" | Risk: ""UnauthorizedAccess"" | Risk: ""UnauthorizedAccess"" | Risk: ""UnauthorizedAccess"" | Risk: ""UnauthorizedAccess"" | Risk: ""UnauthorizedAccess"" | Risk: ""UnauthorizedAccess"" | Risk: ""OutsideEU"" | Risk: ""OutsideEU"" | Risk: ""OutsideEU"" | Risk: ""OutsideEU"" | Risk: ""OutsideEU"" | Risk: ""OutsideEU"" | Risk: ""OutsideEU"" | Risk: ""OutsideEU"" | Risk: ""OutsideEU"" | Risk: ""OutsideEU"" | Risk: ""OutsideEU"" | ","No possible adaptation found","",""
"RandomSearch","10","7","60.7842677","Risk: ""UnauthorizedAccess"" | Risk: ""UnauthorizedAccess"" | Risk: ""UnauthorizedAccess"" | Risk: ""UnauthorizedAccess"" | Risk: ""UnauthorizedAccess"" | Risk: ""UnauthorizedAccess"" | Risk: ""UnauthorizedAccess"" | Risk: ""UnauthorizedAccess"" | Risk: ""UnauthorizedAccess"" | Risk: ""UnauthorizedAccess"" | Risk: ""UnauthorizedAccess"" | Risk: ""OutsideEU"" | Risk: ""OutsideEU"" | Risk: ""OutsideEU"" | Risk: ""OutsideEU"" | Risk: ""OutsideEU"" | Risk: ""OutsideEU"" | Risk: ""OutsideEU"" | Risk: ""OutsideEU"" | Risk: ""OutsideEU"" | Risk: ""OutsideEU"" | Risk: ""OutsideEU"" | ","No possible adaptation found","",""
"BestFirstSearch","10","8","60.0350489","Risk: ""UnauthorizedAccess"" | Risk: ""UnauthorizedAccess"" | Risk: ""UnauthorizedAccess"" | Risk: ""UnauthorizedAccess"" | Risk: ""UnauthorizedAccess"" | Risk: ""UnauthorizedAccess"" | Risk: ""UnauthorizedAccess"" | Risk: ""UnauthorizedAccess"" | Risk: ""UnauthorizedAccess"" | Risk: ""UnauthorizedAccess"" | Risk: ""UnauthorizedAccess"" | Risk: ""OutsideEU"" | Risk: ""OutsideEU"" | Risk: ""OutsideEU"" | Risk: ""OutsideEU"" | Risk: ""OutsideEU"" | Risk: ""OutsideEU"" | Risk: ""OutsideEU"" | Risk: ""OutsideEU"" | Risk: ""OutsideEU"" | Risk: ""OutsideEU"" | Risk: ""OutsideEU"" | ","OutsideEU: Adaptation_1_3 | OutsideEU: Adaptation_1_3 | OutsideEU: Adaptation_1_3 | UnauthorizedAccess: Adaptation_2_3 | UnauthorizedAccess: Adaptation_2_3 | UnauthorizedAccess: Adaptation_2_3 | UnauthorizedAccess: Adaptation_2_2 | UnauthorizedAccess: Adaptation_2_2 | UnauthorizedAccess: Adaptation_2_2 | UnauthorizedAccess: Adaptation_2_2 | UnauthorizedAccess: Adaptation_2_2 | UnauthorizedAccess: Adaptation_2_2 | UnauthorizedAccess: Adaptation_2_2 | UnauthorizedAccess: Adaptation_2_2 | ","7","7.233599999999999"
"DepthSearch","10","8","60.1778219","Risk: ""UnauthorizedAccess"" | Risk: ""UnauthorizedAccess"" | Risk: ""UnauthorizedAccess"" | Risk: ""UnauthorizedAccess"" | Risk: ""UnauthorizedAccess"" | Risk: ""UnauthorizedAccess"" | Risk: ""UnauthorizedAccess"" | Risk: ""UnauthorizedAccess"" | Risk: ""UnauthorizedAccess"" | Risk: ""UnauthorizedAccess"" | Risk: ""UnauthorizedAccess"" | Risk: ""OutsideEU"" | Risk: ""OutsideEU"" | Risk: ""OutsideEU"" | Risk: ""OutsideEU"" | Risk: ""OutsideEU"" | Risk: ""OutsideEU"" | Risk: ""OutsideEU"" | Risk: ""OutsideEU"" | Risk: ""OutsideEU"" | Risk: ""OutsideEU"" | Risk: ""OutsideEU"" | ","UnauthorizedAccess: Adaptation_2_3 | UnauthorizedAccess: Adaptation_2_2 | UnauthorizedAccess: Adaptation_2_2 | UnauthorizedAccess: Adaptation_2_2 | UnauthorizedAccess: Adaptation_2_2 | UnauthorizedAccess: Adaptation_2_2 | UnauthorizedAccess: Adaptation_2_2 | UnauthorizedAccess: Adaptation_2_2 | UnauthorizedAccess: Adaptation_2_2 | UnauthorizedAccess: Adaptation_2_2 | UnauthorizedAccess: Adaptation_2_2 | OutsideEU: Adaptation_1_2 | OutsideEU: Adaptation_1_2 | OutsideEU: Adaptation_1_2 | OutsideEU: Adaptation_1_2 | OutsideEU: Adaptation_1_2 | OutsideEU: Adaptation_1_2 | OutsideEU: Adaptation_1_2 | OutsideEU: Adaptation_1_2 | OutsideEU: Adaptation_1_2 | OutsideEU: Adaptation_1_2 | OutsideEU: Adaptation_1_2 | ","23","26.726399999999984"
"BreadthSearch","10","8","60.0455386","Risk: ""UnauthorizedAccess"" | Risk: ""UnauthorizedAccess"" | Risk: ""UnauthorizedAccess"" | Risk: ""UnauthorizedAccess"" | Risk: ""UnauthorizedAccess"" | Risk: ""UnauthorizedAccess"" | Risk: ""UnauthorizedAccess"" | Risk: ""UnauthorizedAccess"" | Risk: ""UnauthorizedAccess"" | Risk: ""UnauthorizedAccess"" | Risk: ""UnauthorizedAccess"" | Risk: ""OutsideEU"" | Risk: ""OutsideEU"" | Risk: ""OutsideEU"" | Risk: ""OutsideEU"" | Risk: ""OutsideEU"" | Risk: ""OutsideEU"" | Risk: ""OutsideEU"" | Risk: ""OutsideEU"" | Risk: ""OutsideEU"" | Risk: ""OutsideEU"" | Risk: ""OutsideEU"" | ","No possible adaptation found","",""
"RandomSearch","10","8","60.0248524","Risk: ""UnauthorizedAccess"" | Risk: ""UnauthorizedAccess"" | Risk: ""UnauthorizedAccess"" | Risk: ""UnauthorizedAccess"" | Risk: ""UnauthorizedAccess"" | Risk: ""UnauthorizedAccess"" | Risk: ""UnauthorizedAccess"" | Risk: ""UnauthorizedAccess"" | Risk: ""UnauthorizedAccess"" | Risk: ""UnauthorizedAccess"" | Risk: ""UnauthorizedAccess"" | Risk: ""OutsideEU"" | Risk: ""OutsideEU"" | Risk: ""OutsideEU"" | Risk: ""OutsideEU"" | Risk: ""OutsideEU"" | Risk: ""OutsideEU"" | Risk: ""OutsideEU"" | Risk: ""OutsideEU"" | Risk: ""OutsideEU"" | Risk: ""OutsideEU"" | Risk: ""OutsideEU"" | ","UnauthorizedAccess: Adaptation_2_2 | UnauthorizedAccess: Adaptation_2_3 | OutsideEU: Adaptation_1_3 | UnauthorizedAccess: Adaptation_2_2 | UnauthorizedAccess: Adaptation_2_2 | UnauthorizedAccess: Adaptation_2_3 | OutsideEU: Adaptation_1_1 | UnauthorizedAccess: Adaptation_2_2 | OutsideEU: Adaptation_1_1 | OutsideEU: Adaptation_1_1 | UnauthorizedAccess: Adaptation_2_2 | UnauthorizedAccess: Adaptation_2_3 | OutsideEU: Adaptation_1_2 | OutsideEU: Adaptation_1_1 | UnauthorizedAccess: Adaptation_2_2 | OutsideEU: Adaptation_1_1 | UnauthorizedAccess: Adaptation_2_2 | UnauthorizedAccess: Adaptation_2_2 | ","0","0.0"
"BestFirstSearch","10","9","60.0722623","Risk: ""UnauthorizedAccess"" | Risk: ""UnauthorizedAccess"" | Risk: ""UnauthorizedAccess"" | Risk: ""UnauthorizedAccess"" | Risk: ""UnauthorizedAccess"" | Risk: ""UnauthorizedAccess"" | Risk: ""UnauthorizedAccess"" | Risk: ""UnauthorizedAccess"" | Risk: ""UnauthorizedAccess"" | Risk: ""UnauthorizedAccess"" | Risk: ""UnauthorizedAccess"" | Risk: ""OutsideEU"" | Risk: ""OutsideEU"" | Risk: ""OutsideEU"" | Risk: ""OutsideEU"" | Risk: ""OutsideEU"" | Risk: ""OutsideEU"" | Risk: ""OutsideEU"" | Risk: ""OutsideEU"" | Risk: ""OutsideEU"" | Risk: ""OutsideEU"" | Risk: ""OutsideEU"" | ","OutsideEU: Adaptation_1_3 | OutsideEU: Adaptation_1_3 | OutsideEU: Adaptation_1_3 | UnauthorizedAccess: Adaptation_2_3 | UnauthorizedAccess: Adaptation_2_3 | UnauthorizedAccess: Adaptation_2_3 | UnauthorizedAccess: Adaptation_2_2 | UnauthorizedAccess: Adaptation_2_2 | UnauthorizedAccess: Adaptation_2_2 | UnauthorizedAccess: Adaptation_2_2 | UnauthorizedAccess: Adaptation_2_2 | UnauthorizedAccess: Adaptation_2_2 | UnauthorizedAccess: Adaptation_2_2 | UnauthorizedAccess: Adaptation_2_2 | ","7","7.233599999999999"
"DepthSearch","10","9","60.0986507","Risk: ""UnauthorizedAccess"" | Risk: ""UnauthorizedAccess"" | Risk: ""UnauthorizedAccess"" | Risk: ""UnauthorizedAccess"" | Risk: ""UnauthorizedAccess"" | Risk: ""UnauthorizedAccess"" | Risk: ""UnauthorizedAccess"" | Risk: ""UnauthorizedAccess"" | Risk: ""UnauthorizedAccess"" | Risk: ""UnauthorizedAccess"" | Risk: ""UnauthorizedAccess"" | Risk: ""OutsideEU"" | Risk: ""OutsideEU"" | Risk: ""OutsideEU"" | Risk: ""OutsideEU"" | Risk: ""OutsideEU"" | Risk: ""OutsideEU"" | Risk: ""OutsideEU"" | Risk: ""OutsideEU"" | Risk: ""OutsideEU"" | Risk: ""OutsideEU"" | Risk: ""OutsideEU"" | ","UnauthorizedAccess: Adaptation_2_3 | UnauthorizedAccess: Adaptation_2_3 | UnauthorizedAccess: Adaptation_2_3 | UnauthorizedAccess: Adaptation_2_3 | UnauthorizedAccess: Adaptation_2_3 | UnauthorizedAccess: Adaptation_2_3 | UnauthorizedAccess: Adaptation_2_3 | UnauthorizedAccess: Adaptation_2_3 | UnauthorizedAccess: Adaptation_2_3 | UnauthorizedAccess: Adaptation_2_3 | UnauthorizedAccess: Adaptation_2_3 | OutsideEU: Adaptation_1_3 | OutsideEU: Adaptation_1_3 | OutsideEU: Adaptation_1_3 | OutsideEU: Adaptation_1_3 | OutsideEU: Adaptation_1_3 | OutsideEU: Adaptation_1_3 | OutsideEU: Adaptation_1_3 | OutsideEU: Adaptation_1_3 | OutsideEU: Adaptation_1_3 | OutsideEU: Adaptation_1_3 | OutsideEU: Adaptation_1_3 | ","23","25.051199999999987"
"BreadthSearch","10","9","60.069715","Risk: ""UnauthorizedAccess"" | Risk: ""UnauthorizedAccess"" | Risk: ""UnauthorizedAccess"" | Risk: ""UnauthorizedAccess"" | Risk: ""UnauthorizedAccess"" | Risk: ""UnauthorizedAccess"" | Risk: ""UnauthorizedAccess"" | Risk: ""UnauthorizedAccess"" | Risk: ""UnauthorizedAccess"" | Risk: ""UnauthorizedAccess"" | Risk: ""UnauthorizedAccess"" | Risk: ""OutsideEU"" | Risk: ""OutsideEU"" | Risk: ""OutsideEU"" | Risk: ""OutsideEU"" | Risk: ""OutsideEU"" | Risk: ""OutsideEU"" | Risk: ""OutsideEU"" | Risk: ""OutsideEU"" | Risk: ""OutsideEU"" | Risk: ""OutsideEU"" | Risk: ""OutsideEU"" | ","No possible adaptation found","",""
"RandomSearch","10","9","61.1035121","Risk: ""UnauthorizedAccess"" | Risk: ""UnauthorizedAccess"" | Risk: ""UnauthorizedAccess"" | Risk: ""UnauthorizedAccess"" | Risk: ""UnauthorizedAccess"" | Risk: ""UnauthorizedAccess"" | Risk: ""UnauthorizedAccess"" | Risk: ""UnauthorizedAccess"" | Risk: ""UnauthorizedAccess"" | Risk: ""UnauthorizedAccess"" | Risk: ""UnauthorizedAccess"" | Risk: ""OutsideEU"" | Risk: ""OutsideEU"" | Risk: ""OutsideEU"" | Risk: ""OutsideEU"" | Risk: ""OutsideEU"" | Risk: ""OutsideEU"" | Risk: ""OutsideEU"" | Risk: ""OutsideEU"" | Risk: ""OutsideEU"" | Risk: ""OutsideEU"" | Risk: ""OutsideEU"" | ","No possible adaptation found","",""
