{
  "AsIs": {
    "AsIsModel": {
      "type": "CloudEnvironment",
      "@id": "/",
      "tosca_nodes_root": [
        {
          "type": "FogCompute",
          "@id": "//@tosca_nodes_root.0",
          "name": "Fog Node",
          "id": 0,
          "hosts": [
            {
              "type": "SoftwareComponent",
              "referencedObjectID": "//@tosca_nodes_root.4"
            },
            {
              "type": "SoftwareComponent",
              "referencedObjectID": "//@tosca_nodes_root.3"
            }
          ],
          "jurisdiction": "PT",
          "usageCostPerDay": 0.0,
          "capacity": 0,
          "transferCostPerGB": 0.0,
          "costIncurred": false,
          "compromised": true
        },
        {
          "type": "IoTDevice",
          "@id": "//@tosca_nodes_root.1",
          "name": "CCTV Camera",
          "id": 0,
          "hosts": [
            {
              "type": "SoftwareComponent",
              "referencedObjectID": "//@tosca_nodes_root.6"
            }
          ],
          "jurisdiction": "PT",
          "usageCostPerDay": 0.0,
          "capacity": 0,
          "transferCostPerGB": 0.0,
          "costIncurred": false,
          "compromised": false
        },
        {
          "type": "DataSubject",
          "@id": "//@tosca_nodes_root.2",
          "name": "Data Subject / Pedestrian / Car Driver",
          "id": 0,
          "location": "PT",
          "owns": [
            {
              "type": "Record",
              "referencedObjectID": "//@tosca_nodes_root.5"
            },
            {
              "type": "Record",
              "referencedObjectID": "//@tosca_nodes_root.9"
            },
            {
              "type": "Record",
              "referencedObjectID": "//@tosca_nodes_root.10"
            }
          ]
        },
        {
          "type": "SoftwareComponent",
          "@id": "//@tosca_nodes_root.3",
          "name": "Pre-processing & Analysis",
          "id": 0,
          "hostedOn": {
            "type": "FogCompute",
            "referencedObjectID": "//@tosca_nodes_root.0"
          },
          "controlledBy": [
            {
              "type": "DataController",
              "referencedObjectID": "//@tosca_nodes_root.13"
            }
          ],
          "neededCapacity": 0,
          "hasToBeDeployedOnFogNode": false,
          "transferBy": [
            {
              "type": "DataFlow",
              "referencedObjectID": "//@tosca_nodes_root.7"
            },
            {
              "type": "DataFlow",
              "referencedObjectID": "//@tosca_nodes_root.8"
            }
          ]
        },
        {
          "type": "SoftwareComponent",
          "@id": "//@tosca_nodes_root.4",
          "name": "Video Streamer",
          "id": 0,
          "hostedOn": {
            "type": "FogCompute",
            "referencedObjectID": "//@tosca_nodes_root.0"
          },
          "controlledBy": [
            {
              "type": "DataController",
              "referencedObjectID": "//@tosca_nodes_root.13"
            }
          ],
          "neededCapacity": 0,
          "hasToBeDeployedOnFogNode": false,
          "transferBy": [
            {
              "type": "DataFlow",
              "referencedObjectID": "//@tosca_nodes_root.8"
            },
            {
              "type": "DataFlow",
              "referencedObjectID": "//@tosca_nodes_root.15"
            }
          ]
        },
        {
          "type": "Record",
          "@id": "//@tosca_nodes_root.5",
          "name": "Raw Video File",
          "id": 0,
          "partOf": [
            {
              "type": "DataFlow",
              "referencedObjectID": "//@tosca_nodes_root.7"
            },
            {
              "type": "DataFlow",
              "referencedObjectID": "//@tosca_nodes_root.8"
            },
            {
              "type": "DataFlow",
              "referencedObjectID": "//@tosca_nodes_root.15"
            },
            {
              "type": "StoredDataSet",
              "referencedObjectID": "//@tosca_nodes_root.28"
            },
            {
              "type": "DataFlow",
              "referencedObjectID": "//@tosca_nodes_root.32"
            },
            {
              "type": "DataFlow",
              "referencedObjectID": "//@tosca_nodes_root.17"
            }
          ],
          "sensitive": false,
          "encrypted": false,
          "belongsTo": {
            "type": "DataSubject",
            "referencedObjectID": "//@tosca_nodes_root.2"
          },
          "personal": true
        },
        {
          "type": "SoftwareComponent",
          "@id": "//@tosca_nodes_root.6",
          "name": "Camera Streaming Service",
          "id": 0,
          "hostedOn": {
            "type": "IoTDevice",
            "referencedObjectID": "//@tosca_nodes_root.1"
          },
          "neededCapacity": 0,
          "hasToBeDeployedOnFogNode": false,
          "transferBy": [
            {
              "type": "DataFlow",
              "referencedObjectID": "//@tosca_nodes_root.7"
            }
          ]
        },
        {
          "type": "DataFlow",
          "@id": "//@tosca_nodes_root.7",
          "name": "Data Flow (camera - fog node)",
          "id": 0,
          "consistsOf": [
            {
              "type": "Record",
              "referencedObjectID": "//@tosca_nodes_root.5"
            }
          ],
          "disab": false,
          "amountOfDataInGB": 0.0,
          "transfersTo": [
            {
              "type": "SoftwareComponent",
              "referencedObjectID": "//@tosca_nodes_root.3"
            },
            {
              "type": "SoftwareComponent",
              "referencedObjectID": "//@tosca_nodes_root.6"
            }
          ],
          "connectionType": "Local"
        },
        {
          "type": "DataFlow",
          "@id": "//@tosca_nodes_root.8",
          "name": "Data Flow (pre-processing - video streamer)",
          "id": 0,
          "consistsOf": [
            {
              "type": "Record",
              "referencedObjectID": "//@tosca_nodes_root.5"
            },
            {
              "type": "Record",
              "referencedObjectID": "//@tosca_nodes_root.9"
            },
            {
              "type": "Record",
              "referencedObjectID": "//@tosca_nodes_root.10"
            }
          ],
          "disab": false,
          "amountOfDataInGB": 0.0,
          "transfersTo": [
            {
              "type": "SoftwareComponent",
              "referencedObjectID": "//@tosca_nodes_root.3"
            },
            {
              "type": "SoftwareComponent",
              "referencedObjectID": "//@tosca_nodes_root.4"
            }
          ],
          "connectionType": "Local"
        },
        {
          "type": "Record",
          "@id": "//@tosca_nodes_root.9",
          "name": "Anonymised Video File",
          "id": 0,
          "partOf": [
            {
              "type": "DataFlow",
              "referencedObjectID": "//@tosca_nodes_root.8"
            },
            {
              "type": "DataFlow",
              "referencedObjectID": "//@tosca_nodes_root.15"
            },
            {
              "type": "DataFlow",
              "referencedObjectID": "//@tosca_nodes_root.32"
            },
            {
              "type": "DataFlow",
              "referencedObjectID": "//@tosca_nodes_root.17"
            }
          ],
          "sensitive": false,
          "encrypted": false,
          "belongsTo": {
            "type": "DataSubject",
            "referencedObjectID": "//@tosca_nodes_root.2"
          },
          "personal": false
        },
        {
          "type": "Record",
          "@id": "//@tosca_nodes_root.10",
          "name": "Metadata",
          "id": 0,
          "partOf": [
            {
              "type": "DataFlow",
              "referencedObjectID": "//@tosca_nodes_root.8"
            },
            {
              "type": "DataFlow",
              "referencedObjectID": "//@tosca_nodes_root.15"
            }
          ],
          "sensitive": false,
          "encrypted": false,
          "belongsTo": {
            "type": "DataSubject",
            "referencedObjectID": "//@tosca_nodes_root.2"
          },
          "personal": false
        },
        {
          "type": "CloudCompute",
          "@id": "//@tosca_nodes_root.11",
          "name": "Cloud Centre",
          "id": 0,
          "hosts": [
            {
              "type": "SoftwareComponent",
              "referencedObjectID": "//@tosca_nodes_root.14"
            },
            {
              "type": "DBMS",
              "referencedObjectID": "//@tosca_nodes_root.30"
            }
          ],
          "jurisdiction": "PT",
          "operatedByIaaSOperator": [
            {
              "type": "IaaSOperator",
              "referencedObjectID": "//@tosca_nodes_root.26"
            }
          ],
          "usageCostPerDay": 0.0,
          "capacity": 0,
          "transferCostPerGB": 0.0,
          "costIncurred": false,
          "compromised": false
        },
        {
          "type": "CloudCompute",
          "@id": "//@tosca_nodes_root.12",
          "name": "Monitoring Platform",
          "id": 0,
          "hosts": [
            {
              "type": "SoftwareComponent",
              "referencedObjectID": "//@tosca_nodes_root.16"
            }
          ],
          "jurisdiction": "PT",
          "usageCostPerDay": 0.0,
          "capacity": 0,
          "transferCostPerGB": 0.0,
          "operatedByPaaSOperator": [
            {
              "type": "PaaSOperator",
              "referencedObjectID": "//@tosca_nodes_root.27"
            }
          ],
          "costIncurred": false,
          "compromised": false
        },
        {
          "type": "DataController",
          "@id": "//@tosca_nodes_root.13",
          "name": "Data Controller",
          "id": 0,
          "location": "PT",
          "controls": [
            {
              "type": "SoftwareComponent",
              "referencedObjectID": "//@tosca_nodes_root.3"
            },
            {
              "type": "SoftwareComponent",
              "referencedObjectID": "//@tosca_nodes_root.4"
            }
          ]
        },
        {
          "type": "SoftwareComponent",
          "@id": "//@tosca_nodes_root.14",
          "name": "Cloud Centre Software",
          "id": 0,
          "hostedOn": {
            "type": "CloudCompute",
            "referencedObjectID": "//@tosca_nodes_root.11"
          },
          "neededCapacity": 0,
          "hasToBeDeployedOnFogNode": false,
          "transferBy": [
            {
              "type": "DataFlow",
              "referencedObjectID": "//@tosca_nodes_root.15"
            },
            {
              "type": "DataFlow",
              "referencedObjectID": "//@tosca_nodes_root.17"
            },
            {
              "type": "DataFlow",
              "referencedObjectID": "//@tosca_nodes_root.24"
            }
          ]
        },
        {
          "type": "DataFlow",
          "@id": "//@tosca_nodes_root.15",
          "name": "Data Flow (Video Streamer - Cloud Centre)",
          "id": 0,
          "consistsOf": [
            {
              "type": "Record",
              "referencedObjectID": "//@tosca_nodes_root.5"
            },
            {
              "type": "Record",
              "referencedObjectID": "//@tosca_nodes_root.9"
            },
            {
              "type": "Record",
              "referencedObjectID": "//@tosca_nodes_root.10"
            }
          ],
          "disab": false,
          "amountOfDataInGB": 0.0,
          "transfersTo": [
            {
              "type": "SoftwareComponent",
              "referencedObjectID": "//@tosca_nodes_root.4"
            },
            {
              "type": "SoftwareComponent",
              "referencedObjectID": "//@tosca_nodes_root.14"
            }
          ],
          "connectionType": "VPN"
        },
        {
          "type": "SoftwareComponent",
          "@id": "//@tosca_nodes_root.16",
          "name": "Monitoring Software",
          "id": 0,
          "hostedOn": {
            "type": "CloudCompute",
            "referencedObjectID": "//@tosca_nodes_root.12"
          },
          "creates": [
            {
              "type": "StoredDataSet",
              "referencedObjectID": "//@tosca_nodes_root.28"
            }
          ],
          "neededCapacity": 0,
          "hasToBeDeployedOnFogNode": false,
          "transferBy": [
            {
              "type": "DataFlow",
              "referencedObjectID": "//@tosca_nodes_root.17"
            },
            {
              "type": "DataFlow",
              "referencedObjectID": "//@tosca_nodes_root.32"
            }
          ]
        },
        {
          "type": "DataFlow",
          "@id": "//@tosca_nodes_root.17",
          "name": "Data Flow (Cloud Centre - Monitoring Software)",
          "id": 0,
          "consistsOf": [
            {
              "type": "Record",
              "referencedObjectID": "//@tosca_nodes_root.5"
            },
            {
              "type": "Record",
              "referencedObjectID": "//@tosca_nodes_root.9"
            },
            {
              "type": "Record",
              "referencedObjectID": "//@tosca_nodes_root.18"
            },
            {
              "type": "Record",
              "referencedObjectID": "//@tosca_nodes_root.19"
            },
            {
              "type": "Record",
              "referencedObjectID": "//@tosca_nodes_root.25"
            }
          ],
          "disab": false,
          "amountOfDataInGB": 0.0,
          "transfersTo": [
            {
              "type": "SoftwareComponent",
              "referencedObjectID": "//@tosca_nodes_root.14"
            },
            {
              "type": "SoftwareComponent",
              "referencedObjectID": "//@tosca_nodes_root.16"
            }
          ],
          "connectionType": "Internet"
        },
        {
          "type": "Record",
          "@id": "//@tosca_nodes_root.18",
          "name": "Video Analytic",
          "id": 0,
          "partOf": [
            {
              "type": "DataFlow",
              "referencedObjectID": "//@tosca_nodes_root.17"
            },
            {
              "type": "StoredDataSet",
              "referencedObjectID": "//@tosca_nodes_root.28"
            },
            {
              "type": "DataFlow",
              "referencedObjectID": "//@tosca_nodes_root.32"
            }
          ],
          "sensitive": false,
          "encrypted": false,
          "personal": false
        },
        {
          "type": "Record",
          "@id": "//@tosca_nodes_root.19",
          "name": "Incident",
          "id": 0,
          "partOf": [
            {
              "type": "DataFlow",
              "referencedObjectID": "//@tosca_nodes_root.17"
            },
            {
              "type": "StoredDataSet",
              "referencedObjectID": "//@tosca_nodes_root.28"
            },
            {
              "type": "DataFlow",
              "referencedObjectID": "//@tosca_nodes_root.32"
            }
          ],
          "sensitive": false,
          "encrypted": false,
          "personal": false
        },
        {
          "type": "DataProcessor",
          "@id": "//@tosca_nodes_root.20",
          "name": "Data Processor / Law Enforcement Agent / First Responder",
          "id": 0,
          "location": "PT",
          "accesses": [
            {
              "type": "DataFlow",
              "referencedObjectID": "//@tosca_nodes_root.32"
            }
          ]
        },
        {
          "type": "DataSubject",
          "@id": "//@tosca_nodes_root.21",
          "name": "Data Subject / Pedestrian / Car Driver (2)",
          "id": 0,
          "location": "PT",
          "owns": [
            {
              "type": "Record",
              "referencedObjectID": "//@tosca_nodes_root.25"
            }
          ]
        },
        {
          "type": "IoTDevice",
          "@id": "//@tosca_nodes_root.22",
          "name": "Smartphone",
          "id": 0,
          "hosts": [
            {
              "type": "SoftwareComponent",
              "referencedObjectID": "//@tosca_nodes_root.23"
            }
          ],
          "jurisdiction": "PT",
          "usageCostPerDay": 0.0,
          "capacity": 0,
          "transferCostPerGB": 0.0,
          "costIncurred": false,
          "compromised": false
        },
        {
          "type": "SoftwareComponent",
          "@id": "//@tosca_nodes_root.23",
          "name": "Reporter of Incident",
          "id": 0,
          "hostedOn": {
            "type": "IoTDevice",
            "referencedObjectID": "//@tosca_nodes_root.22"
          },
          "neededCapacity": 0,
          "hasToBeDeployedOnFogNode": false,
          "transferBy": [
            {
              "type": "DataFlow",
              "referencedObjectID": "//@tosca_nodes_root.24"
            }
          ]
        },
        {
          "type": "DataFlow",
          "@id": "//@tosca_nodes_root.24",
          "name": "Data Flow (Smartphone - Monitoring Platform)",
          "id": 0,
          "consistsOf": [
            {
              "type": "Record",
              "referencedObjectID": "//@tosca_nodes_root.25"
            }
          ],
          "disab": false,
          "amountOfDataInGB": 0.0,
          "transfersTo": [
            {
              "type": "SoftwareComponent",
              "referencedObjectID": "//@tosca_nodes_root.14"
            },
            {
              "type": "SoftwareComponent",
              "referencedObjectID": "//@tosca_nodes_root.23"
            }
          ],
          "connectionType": "Internet"
        },
        {
          "type": "Record",
          "@id": "//@tosca_nodes_root.25",
          "name": "Incident Report",
          "id": 0,
          "partOf": [
            {
              "type": "DataFlow",
              "referencedObjectID": "//@tosca_nodes_root.17"
            },
            {
              "type": "DataFlow",
              "referencedObjectID": "//@tosca_nodes_root.24"
            },
            {
              "type": "StoredDataSet",
              "referencedObjectID": "//@tosca_nodes_root.28"
            },
            {
              "type": "DataFlow",
              "referencedObjectID": "//@tosca_nodes_root.32"
            }
          ],
          "sensitive": false,
          "encrypted": false,
          "belongsTo": {
            "type": "DataSubject",
            "referencedObjectID": "//@tosca_nodes_root.21"
          },
          "personal": false
        },
        {
          "type": "IaaSOperator",
          "@id": "//@tosca_nodes_root.26",
          "name": "Ubiwhere",
          "id": 0,
          "operatesCompute": [
            {
              "type": "CloudCompute",
              "referencedObjectID": "//@tosca_nodes_root.11"
            }
          ]
        },
        {
          "type": "PaaSOperator",
          "@id": "//@tosca_nodes_root.27",
          "name": "ThirdParty",
          "id": 0,
          "operatesCompute": [
            {
              "type": "CloudCompute",
              "referencedObjectID": "//@tosca_nodes_root.12"
            }
          ]
        },
        {
          "type": "StoredDataSet",
          "@id": "//@tosca_nodes_root.28",
          "name": "Monitoring Data Set",
          "id": 0,
          "consistsOf": [
            {
              "type": "Record",
              "referencedObjectID": "//@tosca_nodes_root.5"
            },
            {
              "type": "Record",
              "referencedObjectID": "//@tosca_nodes_root.18"
            },
            {
              "type": "Record",
              "referencedObjectID": "//@tosca_nodes_root.19"
            },
            {
              "type": "Record",
              "referencedObjectID": "//@tosca_nodes_root.25"
            }
          ],
          "storedIn": {
            "type": "Database",
            "referencedObjectID": "//@tosca_nodes_root.31"
          },
          "createdBySoftwareComponent": {
            "type": "SoftwareComponent",
            "referencedObjectID": "//@tosca_nodes_root.16"
          }
        },
        {
          "type": "FogCompute",
          "@id": "//@tosca_nodes_root.29",
          "name": "Fog Node 1",
          "id": 0,
          "jurisdiction": "PT",
          "usageCostPerDay": 0.0,
          "capacity": 0,
          "transferCostPerGB": 0.0,
          "costIncurred": false,
          "compromised": false
        },
        {
          "type": "DBMS",
          "@id": "//@tosca_nodes_root.30",
          "name": "DBMS",
          "id": 0,
          "hostedOn": {
            "type": "CloudCompute",
            "referencedObjectID": "//@tosca_nodes_root.11"
          },
          "neededCapacity": 0,
          "hasToBeDeployedOnFogNode": false,
          "hosts": [
            {
              "type": "Database",
              "referencedObjectID": "//@tosca_nodes_root.31"
            }
          ]
        },
        {
          "type": "Database",
          "@id": "//@tosca_nodes_root.31",
          "name": "Database",
          "id": 0,
          "hostedOn": {
            "type": "DBMS",
            "referencedObjectID": "//@tosca_nodes_root.30"
          },
          "stores": [
            {
              "type": "StoredDataSet",
              "referencedObjectID": "//@tosca_nodes_root.28"
            }
          ],
          "encrypted": false
        },
        {
          "type": "DataFlow",
          "@id": "//@tosca_nodes_root.32",
          "name": "Data Flow (DataProcessor - Monitoring Platform)",
          "id": 0,
          "consistsOf": [
            {
              "type": "Record",
              "referencedObjectID": "//@tosca_nodes_root.5"
            },
            {
              "type": "Record",
              "referencedObjectID": "//@tosca_nodes_root.9"
            },
            {
              "type": "Record",
              "referencedObjectID": "//@tosca_nodes_root.18"
            },
            {
              "type": "Record",
              "referencedObjectID": "//@tosca_nodes_root.19"
            },
            {
              "type": "Record",
              "referencedObjectID": "//@tosca_nodes_root.25"
            }
          ],
          "accessedBy": {
            "type": "DataProcessor",
            "referencedObjectID": "//@tosca_nodes_root.20"
          },
          "disab": false,
          "amountOfDataInGB": 0.0,
          "transfersTo": [
            {
              "type": "SoftwareComponent",
              "referencedObjectID": "//@tosca_nodes_root.16"
            }
          ],
          "connectionType": "Local"
        }
      ]
    },
    "OldAsIsModel": {
      "type": "CloudEnvironment",
      "@id": "/",
      "tosca_nodes_root": [
        {
          "type": "FogCompute",
          "@id": "//@tosca_nodes_root.0",
          "name": "Fog Node",
          "id": 0,
          "hosts": [
            {
              "type": "SoftwareComponent",
              "referencedObjectID": "//@tosca_nodes_root.4"
            },
            {
              "type": "SoftwareComponent",
              "referencedObjectID": "//@tosca_nodes_root.3"
            }
          ],
          "jurisdiction": "PT",
          "usageCostPerDay": 0.0,
          "capacity": 0,
          "transferCostPerGB": 0.0,
          "costIncurred": false,
          "compromised": false
        },
        {
          "type": "IoTDevice",
          "@id": "//@tosca_nodes_root.1",
          "name": "CCTV Camera",
          "id": 0,
          "hosts": [
            {
              "type": "SoftwareComponent",
              "referencedObjectID": "//@tosca_nodes_root.6"
            }
          ],
          "jurisdiction": "PT",
          "usageCostPerDay": 0.0,
          "capacity": 0,
          "transferCostPerGB": 0.0,
          "costIncurred": false,
          "compromised": false
        },
        {
          "type": "DataSubject",
          "@id": "//@tosca_nodes_root.2",
          "name": "Data Subject / Pedestrian / Car Driver",
          "id": 0,
          "location": "PT",
          "owns": [
            {
              "type": "Record",
              "referencedObjectID": "//@tosca_nodes_root.5"
            },
            {
              "type": "Record",
              "referencedObjectID": "//@tosca_nodes_root.9"
            },
            {
              "type": "Record",
              "referencedObjectID": "//@tosca_nodes_root.10"
            }
          ]
        },
        {
          "type": "SoftwareComponent",
          "@id": "//@tosca_nodes_root.3",
          "name": "Pre-processing & Analysis",
          "id": 0,
          "hostedOn": {
            "type": "FogCompute",
            "referencedObjectID": "//@tosca_nodes_root.0"
          },
          "controlledBy": [
            {
              "type": "DataController",
              "referencedObjectID": "//@tosca_nodes_root.13"
            }
          ],
          "neededCapacity": 0,
          "hasToBeDeployedOnFogNode": false,
          "transferBy": [
            {
              "type": "DataFlow",
              "referencedObjectID": "//@tosca_nodes_root.7"
            },
            {
              "type": "DataFlow",
              "referencedObjectID": "//@tosca_nodes_root.8"
            }
          ]
        },
        {
          "type": "SoftwareComponent",
          "@id": "//@tosca_nodes_root.4",
          "name": "Video Streamer",
          "id": 0,
          "hostedOn": {
            "type": "FogCompute",
            "referencedObjectID": "//@tosca_nodes_root.0"
          },
          "controlledBy": [
            {
              "type": "DataController",
              "referencedObjectID": "//@tosca_nodes_root.13"
            }
          ],
          "neededCapacity": 0,
          "hasToBeDeployedOnFogNode": false,
          "transferBy": [
            {
              "type": "DataFlow",
              "referencedObjectID": "//@tosca_nodes_root.8"
            },
            {
              "type": "DataFlow",
              "referencedObjectID": "//@tosca_nodes_root.15"
            }
          ]
        },
        {
          "type": "Record",
          "@id": "//@tosca_nodes_root.5",
          "name": "Raw Video File",
          "id": 0,
          "partOf": [
            {
              "type": "DataFlow",
              "referencedObjectID": "//@tosca_nodes_root.7"
            },
            {
              "type": "DataFlow",
              "referencedObjectID": "//@tosca_nodes_root.8"
            },
            {
              "type": "DataFlow",
              "referencedObjectID": "//@tosca_nodes_root.15"
            },
            {
              "type": "StoredDataSet",
              "referencedObjectID": "//@tosca_nodes_root.28"
            },
            {
              "type": "DataFlow",
              "referencedObjectID": "//@tosca_nodes_root.32"
            },
            {
              "type": "DataFlow",
              "referencedObjectID": "//@tosca_nodes_root.17"
            }
          ],
          "sensitive": false,
          "encrypted": false,
          "belongsTo": {
            "type": "DataSubject",
            "referencedObjectID": "//@tosca_nodes_root.2"
          },
          "personal": true
        },
        {
          "type": "SoftwareComponent",
          "@id": "//@tosca_nodes_root.6",
          "name": "Camera Streaming Service",
          "id": 0,
          "hostedOn": {
            "type": "IoTDevice",
            "referencedObjectID": "//@tosca_nodes_root.1"
          },
          "neededCapacity": 0,
          "hasToBeDeployedOnFogNode": false,
          "transferBy": [
            {
              "type": "DataFlow",
              "referencedObjectID": "//@tosca_nodes_root.7"
            }
          ]
        },
        {
          "type": "DataFlow",
          "@id": "//@tosca_nodes_root.7",
          "name": "Data Flow (camera - fog node)",
          "id": 0,
          "consistsOf": [
            {
              "type": "Record",
              "referencedObjectID": "//@tosca_nodes_root.5"
            }
          ],
          "disab": false,
          "amountOfDataInGB": 0.0,
          "transfersTo": [
            {
              "type": "SoftwareComponent",
              "referencedObjectID": "//@tosca_nodes_root.3"
            },
            {
              "type": "SoftwareComponent",
              "referencedObjectID": "//@tosca_nodes_root.6"
            }
          ],
          "connectionType": "Local"
        },
        {
          "type": "DataFlow",
          "@id": "//@tosca_nodes_root.8",
          "name": "Data Flow (pre-processing - video streamer)",
          "id": 0,
          "consistsOf": [
            {
              "type": "Record",
              "referencedObjectID": "//@tosca_nodes_root.5"
            },
            {
              "type": "Record",
              "referencedObjectID": "//@tosca_nodes_root.9"
            },
            {
              "type": "Record",
              "referencedObjectID": "//@tosca_nodes_root.10"
            }
          ],
          "disab": false,
          "amountOfDataInGB": 0.0,
          "transfersTo": [
            {
              "type": "SoftwareComponent",
              "referencedObjectID": "//@tosca_nodes_root.3"
            },
            {
              "type": "SoftwareComponent",
              "referencedObjectID": "//@tosca_nodes_root.4"
            }
          ],
          "connectionType": "Local"
        },
        {
          "type": "Record",
          "@id": "//@tosca_nodes_root.9",
          "name": "Anonymised Video File",
          "id": 0,
          "partOf": [
            {
              "type": "DataFlow",
              "referencedObjectID": "//@tosca_nodes_root.8"
            },
            {
              "type": "DataFlow",
              "referencedObjectID": "//@tosca_nodes_root.15"
            },
            {
              "type": "DataFlow",
              "referencedObjectID": "//@tosca_nodes_root.32"
            },
            {
              "type": "DataFlow",
              "referencedObjectID": "//@tosca_nodes_root.17"
            }
          ],
          "sensitive": false,
          "encrypted": false,
          "belongsTo": {
            "type": "DataSubject",
            "referencedObjectID": "//@tosca_nodes_root.2"
          },
          "personal": false
        },
        {
          "type": "Record",
          "@id": "//@tosca_nodes_root.10",
          "name": "Metadata",
          "id": 0,
          "partOf": [
            {
              "type": "DataFlow",
              "referencedObjectID": "//@tosca_nodes_root.8"
            },
            {
              "type": "DataFlow",
              "referencedObjectID": "//@tosca_nodes_root.15"
            }
          ],
          "sensitive": false,
          "encrypted": false,
          "belongsTo": {
            "type": "DataSubject",
            "referencedObjectID": "//@tosca_nodes_root.2"
          },
          "personal": false
        },
        {
          "type": "CloudCompute",
          "@id": "//@tosca_nodes_root.11",
          "name": "Cloud Centre",
          "id": 0,
          "hosts": [
            {
              "type": "SoftwareComponent",
              "referencedObjectID": "//@tosca_nodes_root.14"
            },
            {
              "type": "DBMS",
              "referencedObjectID": "//@tosca_nodes_root.30"
            }
          ],
          "jurisdiction": "PT",
          "operatedByIaaSOperator": [
            {
              "type": "IaaSOperator",
              "referencedObjectID": "//@tosca_nodes_root.26"
            }
          ],
          "usageCostPerDay": 0.0,
          "capacity": 0,
          "transferCostPerGB": 0.0,
          "costIncurred": false,
          "compromised": false
        },
        {
          "type": "CloudCompute",
          "@id": "//@tosca_nodes_root.12",
          "name": "Monitoring Platform",
          "id": 0,
          "hosts": [
            {
              "type": "SoftwareComponent",
              "referencedObjectID": "//@tosca_nodes_root.16"
            }
          ],
          "jurisdiction": "PT",
          "usageCostPerDay": 0.0,
          "capacity": 0,
          "transferCostPerGB": 0.0,
          "operatedByPaaSOperator": [
            {
              "type": "PaaSOperator",
              "referencedObjectID": "//@tosca_nodes_root.27"
            }
          ],
          "costIncurred": false,
          "compromised": false
        },
        {
          "type": "DataController",
          "@id": "//@tosca_nodes_root.13",
          "name": "Data Controller",
          "id": 0,
          "location": "PT",
          "controls": [
            {
              "type": "SoftwareComponent",
              "referencedObjectID": "//@tosca_nodes_root.3"
            },
            {
              "type": "SoftwareComponent",
              "referencedObjectID": "//@tosca_nodes_root.4"
            }
          ]
        },
        {
          "type": "SoftwareComponent",
          "@id": "//@tosca_nodes_root.14",
          "name": "Cloud Centre Software",
          "id": 0,
          "hostedOn": {
            "type": "CloudCompute",
            "referencedObjectID": "//@tosca_nodes_root.11"
          },
          "neededCapacity": 0,
          "hasToBeDeployedOnFogNode": false,
          "transferBy": [
            {
              "type": "DataFlow",
              "referencedObjectID": "//@tosca_nodes_root.15"
            },
            {
              "type": "DataFlow",
              "referencedObjectID": "//@tosca_nodes_root.17"
            },
            {
              "type": "DataFlow",
              "referencedObjectID": "//@tosca_nodes_root.24"
            }
          ]
        },
        {
          "type": "DataFlow",
          "@id": "//@tosca_nodes_root.15",
          "name": "Data Flow (Video Streamer - Cloud Centre)",
          "id": 0,
          "consistsOf": [
            {
              "type": "Record",
              "referencedObjectID": "//@tosca_nodes_root.5"
            },
            {
              "type": "Record",
              "referencedObjectID": "//@tosca_nodes_root.9"
            },
            {
              "type": "Record",
              "referencedObjectID": "//@tosca_nodes_root.10"
            }
          ],
          "disab": false,
          "amountOfDataInGB": 0.0,
          "transfersTo": [
            {
              "type": "SoftwareComponent",
              "referencedObjectID": "//@tosca_nodes_root.4"
            },
            {
              "type": "SoftwareComponent",
              "referencedObjectID": "//@tosca_nodes_root.14"
            }
          ],
          "connectionType": "VPN"
        },
        {
          "type": "SoftwareComponent",
          "@id": "//@tosca_nodes_root.16",
          "name": "Monitoring Software",
          "id": 0,
          "hostedOn": {
            "type": "CloudCompute",
            "referencedObjectID": "//@tosca_nodes_root.12"
          },
          "creates": [
            {
              "type": "StoredDataSet",
              "referencedObjectID": "//@tosca_nodes_root.28"
            }
          ],
          "neededCapacity": 0,
          "hasToBeDeployedOnFogNode": false,
          "transferBy": [
            {
              "type": "DataFlow",
              "referencedObjectID": "//@tosca_nodes_root.17"
            },
            {
              "type": "DataFlow",
              "referencedObjectID": "//@tosca_nodes_root.32"
            }
          ]
        },
        {
          "type": "DataFlow",
          "@id": "//@tosca_nodes_root.17",
          "name": "Data Flow (Cloud Centre - Monitoring Software)",
          "id": 0,
          "consistsOf": [
            {
              "type": "Record",
              "referencedObjectID": "//@tosca_nodes_root.5"
            },
            {
              "type": "Record",
              "referencedObjectID": "//@tosca_nodes_root.9"
            },
            {
              "type": "Record",
              "referencedObjectID": "//@tosca_nodes_root.18"
            },
            {
              "type": "Record",
              "referencedObjectID": "//@tosca_nodes_root.19"
            },
            {
              "type": "Record",
              "referencedObjectID": "//@tosca_nodes_root.25"
            }
          ],
          "disab": false,
          "amountOfDataInGB": 0.0,
          "transfersTo": [
            {
              "type": "SoftwareComponent",
              "referencedObjectID": "//@tosca_nodes_root.14"
            },
            {
              "type": "SoftwareComponent",
              "referencedObjectID": "//@tosca_nodes_root.16"
            }
          ],
          "connectionType": "Internet"
        },
        {
          "type": "Record",
          "@id": "//@tosca_nodes_root.18",
          "name": "Video Analytic",
          "id": 0,
          "partOf": [
            {
              "type": "DataFlow",
              "referencedObjectID": "//@tosca_nodes_root.17"
            },
            {
              "type": "StoredDataSet",
              "referencedObjectID": "//@tosca_nodes_root.28"
            },
            {
              "type": "DataFlow",
              "referencedObjectID": "//@tosca_nodes_root.32"
            }
          ],
          "sensitive": false,
          "encrypted": false,
          "personal": false
        },
        {
          "type": "Record",
          "@id": "//@tosca_nodes_root.19",
          "name": "Incident",
          "id": 0,
          "partOf": [
            {
              "type": "DataFlow",
              "referencedObjectID": "//@tosca_nodes_root.17"
            },
            {
              "type": "StoredDataSet",
              "referencedObjectID": "//@tosca_nodes_root.28"
            },
            {
              "type": "DataFlow",
              "referencedObjectID": "//@tosca_nodes_root.32"
            }
          ],
          "sensitive": false,
          "encrypted": false,
          "personal": false
        },
        {
          "type": "DataProcessor",
          "@id": "//@tosca_nodes_root.20",
          "name": "Data Processor / Law Enforcement Agent / First Responder",
          "id": 0,
          "location": "PT",
          "accesses": [
            {
              "type": "DataFlow",
              "referencedObjectID": "//@tosca_nodes_root.32"
            }
          ]
        },
        {
          "type": "DataSubject",
          "@id": "//@tosca_nodes_root.21",
          "name": "Data Subject / Pedestrian / Car Driver (2)",
          "id": 0,
          "location": "PT",
          "owns": [
            {
              "type": "Record",
              "referencedObjectID": "//@tosca_nodes_root.25"
            }
          ]
        },
        {
          "type": "IoTDevice",
          "@id": "//@tosca_nodes_root.22",
          "name": "Smartphone",
          "id": 0,
          "hosts": [
            {
              "type": "SoftwareComponent",
              "referencedObjectID": "//@tosca_nodes_root.23"
            }
          ],
          "jurisdiction": "PT",
          "usageCostPerDay": 0.0,
          "capacity": 0,
          "transferCostPerGB": 0.0,
          "costIncurred": false,
          "compromised": false
        },
        {
          "type": "SoftwareComponent",
          "@id": "//@tosca_nodes_root.23",
          "name": "Reporter of Incident",
          "id": 0,
          "hostedOn": {
            "type": "IoTDevice",
            "referencedObjectID": "//@tosca_nodes_root.22"
          },
          "neededCapacity": 0,
          "hasToBeDeployedOnFogNode": false,
          "transferBy": [
            {
              "type": "DataFlow",
              "referencedObjectID": "//@tosca_nodes_root.24"
            }
          ]
        },
        {
          "type": "DataFlow",
          "@id": "//@tosca_nodes_root.24",
          "name": "Data Flow (Smartphone - Monitoring Platform)",
          "id": 0,
          "consistsOf": [
            {
              "type": "Record",
              "referencedObjectID": "//@tosca_nodes_root.25"
            }
          ],
          "disab": false,
          "amountOfDataInGB": 0.0,
          "transfersTo": [
            {
              "type": "SoftwareComponent",
              "referencedObjectID": "//@tosca_nodes_root.14"
            },
            {
              "type": "SoftwareComponent",
              "referencedObjectID": "//@tosca_nodes_root.23"
            }
          ],
          "connectionType": "Internet"
        },
        {
          "type": "Record",
          "@id": "//@tosca_nodes_root.25",
          "name": "Incident Report",
          "id": 0,
          "partOf": [
            {
              "type": "DataFlow",
              "referencedObjectID": "//@tosca_nodes_root.17"
            },
            {
              "type": "DataFlow",
              "referencedObjectID": "//@tosca_nodes_root.24"
            },
            {
              "type": "StoredDataSet",
              "referencedObjectID": "//@tosca_nodes_root.28"
            },
            {
              "type": "DataFlow",
              "referencedObjectID": "//@tosca_nodes_root.32"
            }
          ],
          "sensitive": false,
          "encrypted": false,
          "belongsTo": {
            "type": "DataSubject",
            "referencedObjectID": "//@tosca_nodes_root.21"
          },
          "personal": false
        },
        {
          "type": "IaaSOperator",
          "@id": "//@tosca_nodes_root.26",
          "name": "Ubiwhere",
          "id": 0,
          "operatesCompute": [
            {
              "type": "CloudCompute",
              "referencedObjectID": "//@tosca_nodes_root.11"
            }
          ]
        },
        {
          "type": "PaaSOperator",
          "@id": "//@tosca_nodes_root.27",
          "name": "ThirdParty",
          "id": 0,
          "operatesCompute": [
            {
              "type": "CloudCompute",
              "referencedObjectID": "//@tosca_nodes_root.12"
            }
          ]
        },
        {
          "type": "StoredDataSet",
          "@id": "//@tosca_nodes_root.28",
          "name": "Monitoring Data Set",
          "id": 0,
          "consistsOf": [
            {
              "type": "Record",
              "referencedObjectID": "//@tosca_nodes_root.5"
            },
            {
              "type": "Record",
              "referencedObjectID": "//@tosca_nodes_root.18"
            },
            {
              "type": "Record",
              "referencedObjectID": "//@tosca_nodes_root.19"
            },
            {
              "type": "Record",
              "referencedObjectID": "//@tosca_nodes_root.25"
            }
          ],
          "storedIn": {
            "type": "Database",
            "referencedObjectID": "//@tosca_nodes_root.31"
          },
          "createdBySoftwareComponent": {
            "type": "SoftwareComponent",
            "referencedObjectID": "//@tosca_nodes_root.16"
          }
        },
        {
          "type": "FogCompute",
          "@id": "//@tosca_nodes_root.29",
          "name": "Fog Node 1",
          "id": 0,
          "jurisdiction": "PT",
          "usageCostPerDay": 0.0,
          "capacity": 0,
          "transferCostPerGB": 0.0,
          "costIncurred": false,
          "compromised": false
        },
        {
          "type": "DBMS",
          "@id": "//@tosca_nodes_root.30",
          "name": "DBMS",
          "id": 0,
          "hostedOn": {
            "type": "CloudCompute",
            "referencedObjectID": "//@tosca_nodes_root.11"
          },
          "neededCapacity": 0,
          "hasToBeDeployedOnFogNode": false,
          "hosts": [
            {
              "type": "Database",
              "referencedObjectID": "//@tosca_nodes_root.31"
            }
          ]
        },
        {
          "type": "Database",
          "@id": "//@tosca_nodes_root.31",
          "name": "Database",
          "id": 0,
          "hostedOn": {
            "type": "DBMS",
            "referencedObjectID": "//@tosca_nodes_root.30"
          },
          "stores": [
            {
              "type": "StoredDataSet",
              "referencedObjectID": "//@tosca_nodes_root.28"
            }
          ],
          "encrypted": false
        },
        {
          "type": "DataFlow",
          "@id": "//@tosca_nodes_root.32",
          "name": "Data Flow (DataProcessor - Monitoring Platform)",
          "id": 0,
          "consistsOf": [
            {
              "type": "Record",
              "referencedObjectID": "//@tosca_nodes_root.5"
            },
            {
              "type": "Record",
              "referencedObjectID": "//@tosca_nodes_root.9"
            },
            {
              "type": "Record",
              "referencedObjectID": "//@tosca_nodes_root.18"
            },
            {
              "type": "Record",
              "referencedObjectID": "//@tosca_nodes_root.19"
            },
            {
              "type": "Record",
              "referencedObjectID": "//@tosca_nodes_root.25"
            }
          ],
          "accessedBy": {
            "type": "DataProcessor",
            "referencedObjectID": "//@tosca_nodes_root.20"
          },
          "disab": false,
          "amountOfDataInGB": 0.0,
          "transfersTo": [
            {
              "type": "SoftwareComponent",
              "referencedObjectID": "//@tosca_nodes_root.16"
            }
          ],
          "connectionType": "Local"
        }
      ]
    },
    "ChangesMadeToAsIsModel": [
      {
        "ObjectToIdentify": {
          "name": "Fog Node",
          "type": "fogprotect.adaptation.ComputingContinuumModel.FogCompute",
          "atID": "//@tosca_nodes_root.0"
        },
        "Changes": [
          {
            "ChangeType": "CHANGE",
            "AttributeChanged": "compromised",
            "AttributeType": "EBoolean",
            "AttributeOldValue": "false",
            "AttributeNewValue": "true"
          }
        ]
      }
    ],
    "Risks": [
      {
        "Name": "CompromisedFogCompute",
        "Description": "Description will be added soon...",
        "ID": 0,
        "Nodes": [
          {
            "Name": "Fog Node",
            "@id": "//@tosca_nodes_root.0"
          },
          {
            "Name": "Video Streamer",
            "@id": "//@tosca_nodes_root.4"
          },
          {
            "Name": "Data Flow (Video Streamer - Cloud Centre)",
            "@id": "//@tosca_nodes_root.15"
          }
        ]
      },
      {
        "Name": "CompromisedFogCompute",
        "Description": "Description will be added soon...",
        "ID": 1,
        "Nodes": [
          {
            "Name": "Fog Node",
            "@id": "//@tosca_nodes_root.0"
          },
          {
            "Name": "Video Streamer",
            "@id": "//@tosca_nodes_root.4"
          },
          {
            "Name": "Data Flow (pre-processing - video streamer)",
            "@id": "//@tosca_nodes_root.8"
          }
        ]
      },
      {
        "Name": "CompromisedFogCompute",
        "Description": "Description will be added soon...",
        "ID": 2,
        "Nodes": [
          {
            "Name": "Fog Node",
            "@id": "//@tosca_nodes_root.0"
          },
          {
            "Name": "Pre-processing & Analysis",
            "@id": "//@tosca_nodes_root.3"
          },
          {
            "Name": "Data Flow (pre-processing - video streamer)",
            "@id": "//@tosca_nodes_root.8"
          }
        ]
      },
      {
        "Name": "CompromisedFogCompute",
        "Description": "Description will be added soon...",
        "ID": 3,
        "Nodes": [
          {
            "Name": "Fog Node",
            "@id": "//@tosca_nodes_root.0"
          },
          {
            "Name": "Pre-processing & Analysis",
            "@id": "//@tosca_nodes_root.3"
          },
          {
            "Name": "Data Flow (camera - fog node)",
            "@id": "//@tosca_nodes_root.7"
          }
        ]
      }
    ]
  },
  "Adaptations": []
}
