{
    "auto":{
        "purchase":{
            "trial":{
                "count":6
            },
            "once":{
                "count":1
            },
            "primary":{
                "count":100
            },
            "advance":{
                "count":200
            },
            "pro":{
                "scale":1.4082
            },
            "showRecommendLabel":true,
            "showAutoRenewProducts":true
        },
        "appSettings":{
            "crfForH264": 23,
            "crfForHEVC": 28,
            "cqForVideoToolbox": 55,
            "compressMode": 2,
            "convertToStereo": true,
            "enableHWAccel": false,
            "optimizeForPlayback": true,
            "showRecommend": false
        },
        "tutorial":{    
            "howToUse": true,
            "appPrompt": true
        }
    }
}
