{
  "type": "service_account",
  "project_id": "sign-fee-collection-system",
  "private_key_id": "00025e7d05005c1230a910fd8e4ae06125914f36",
  "private_key": "-----BEGIN PRIVATE KEY-----\nMIIEvgIBADANBgkqhkiG9w0BAQEFAASCBKgwggSkAgEAAoIBAQDTSa+b3H/sOmCD\n9yPJlq71ag0l3oXN+KH1e9oOCJzzf+doC7+AxwrUuuPFU9GQYRwQbYo7ldLZ4sBz\nxS1iejnaXiP+PXbo1q3M92ZvrkfjzP+R3SVsAOMajL5nQWhrOE84qxcouognyFBY\noqJpGvluod/MSkdp9vhoUcaZIac2DgVHuBOgWgKeMRPHsGolrpoXcWL9TjUttG7p\nQ5q8tYiGFs1+7p/aqTrvd22oq+3OzlGZeXUXhaZTFfBKo4UvcHC16UpGbtlkMR0c\nAGPtZEbVlU6rnaEkFaPOhuFkp4JPcGRmaVth01/MBhnVmJyMoGzvsbldAZ4xdODJ\nYkh/qABXAgMBAAECggEAKoTfGpH+ikbbKmNfJ8+ziL6dQ7wqmB8LVK/mW0GfeB8K\nrfUDRkKH6vRrJsgt2Yy5TZMFqOUHKALKMOICtpkbMFcWjjDHT6b4FdHJovrjC7Qy\n0CM9RyVMjoi5PmU6wqzzwFcp02/qO3tDs/qSjW04uetIcr+V7HyfU7r1KNbNZAKD\ng1a7+yyNBF4vypt27bHJqMqH9P47soK8D5pba7LS3yV5HB/7LdAjb3Aq/omTFR1H\n49Po1VM5TGV3cW46bRPwHNI9APFQRHekDAaVrgYTmBPqSM1L9dtengzVwJpD3rW1\nhoTaI4NCZdXvIwDBJ4oXXIBJMJ0mJcEE4v45dK37IQKBgQD3c0FQKM1j3RZAuWvp\n/2TpD9DSkx+hjH4Q9Avyo4zC3p8l4pBbz86ba31ocWNiZeUnuXjQnxc6SUagqNZp\nVMykVMacdgOW4AthQnlmAGtJpe1fN4AMAeSAVgRlGpx66eL48teaxpgydFNum9fT\nPSl6znFIRazPePwG7uxarsejtwKBgQDalpFPtlBMFcfZg4sABnCuWX0f8qVvcXQL\nKf9CCPJLTuOVczcoH7bpeqXRQkJFxQwLdz78qzWBy6kr/ubrFotbPP7PpMvw8kRV\nr+rnvyX4q44mlfxlBVJU5G9ZqVcetajSwuJrubBSxkjozEwiQULFeTMN5NjG3G/o\n2RcMusTIYQKBgDTVdgeQfrIo3Xx6WrE+p6QfjV24rhNHNQ+XnAl1pDNjZyWmp14D\nE8EZhVBMjYTP7sq5jjM1FLeMN7lL82PQCFW6CCIWDJQlSCi/Eb6WrlGuTO18oylt\nKgXA1/ViZjDUSXMQHrrcVljHf5zpR37B215uP7/HqKsv0NgGIY8HLHcnAoGBAJ8H\nbDDSMxknv35AdaBPDyvJb38Oyc2KfSKiK1OfrqebfXf9muNWL30t/fWAfzbDZT/y\nQaER7pu/0BRyHw5qGHkIp1nqS3XAzHaKxhxUtQt1xLXN6RKWDJA2ocxZp0hwYaL0\npkY5kk6mc+TqvXkugaWpx7sUA6KqPcDqMBrSxtgBAoGBAMQUW2zjKi0PqkrSx4mH\nChZB72FbPOpuda5fxTKBHPJUihnT1hKIK7+JxsJIUuE5OUGOjBokbej+JbVyTO8T\nt2f/OSDyjk0z8zA0YNIorwOXq4KwLifeHbWPkxUCbwQB6zCYPPNbUcMAZFGLJY8Y\nRoHZ/N4HN1w7f/EO10lmoMrd\n-----END PRIVATE KEY-----\n",
  "client_email": "firebase-adminsdk-bpmw3@sign-fee-collection-system.iam.gserviceaccount.com",
  "client_id": "111595762590188839334",
  "auth_uri": "https://accounts.google.com/o/oauth2/auth",
  "token_uri": "https://oauth2.googleapis.com/token",
  "auth_provider_x509_cert_url": "https://www.googleapis.com/oauth2/v1/certs",
  "client_x509_cert_url": "https://www.googleapis.com/robot/v1/metadata/x509/firebase-adminsdk-bpmw3%40sign-fee-collection-system.iam.gserviceaccount.com"
}
