"gateway ID","node MAC","UTC timestamp","us count","frequency","RF chain","RX chain","status","size","modulation","bandwidth","datarate","coderate","RSSI","SNR","payload"
"AA555A0000000101","","2018-07-04 11:50:00.197Z",  44810067, 868100000,1, 0,"CRC_BAD",168,"LORA",125000,"SF7"   ,"4/5",-121,-11.8,"65AC2A32-3BED2E43-22476FCF-6F633876-A738F79C-FB383B72-C9C85366-D40503C4-44E4F60C-EA7EF046-961AE966-E613C1C1-A4BBAAB6-58A77D0C-30E19BD8-F484AE11-33D8744C-613EE5C5-A73447B7-3C1C69E5-9E60C518-7A55C704-DFDBA4DE-8FC7FBFF-221B8D44-A8642A55-33F65DB6-7978AA7D-5ADA12AB-AB75106B-189DD411-18F18C61-0C937091-16F2A736-AA83A0C5-8D3E0265-236A2465-BABEC457-8E00AE2A-416F5820-AC5EAEAA-7B252489"
"AA555A0000000101","","2018-07-04 11:50:10.011Z",  54597172, 867700000,0, 6,"CRC_OK" , 25,"LORA",125000,"SF12"  ,"4/5",-74, +9.8,"40B5FC9F-0900B409-02E5813A-77CA19B3-46722F74-1C51C5DF-90"
"AA555A0000000101","","2018-07-04 11:50:26.032Z",  70646205, 868300000,1, 8,"CRC_BAD",144,"LORA",250000,"SF7"   ,""   ,-118,-11.8,"378BDAA9-642C8309-EA27C1DD-0858A9F3-9D214340-03B2E406-9303F887-2A9BEB51-90CC0BB8-F3F2B8EB-CA1ADC9E-0E1B0320-FCA08AD5-8DC75F66-2B5B8406-61022BB9-3762412A-E93BB724-1C1FB1C4-1C050BF0-AA67F4CC-BC42A57C-6DD55E7A-7B07B1E7-A582E615-0804239F-F047FBF6-AEDFB2E9-39A1C0F6-3A4DF354-D4F58676-26BA2F04-4F0DD804-75872387-D1EE7A68-6182490D"
"AA555A0000000101","","2018-07-04 11:50:27.097Z",  71682916, 868100000,1, 0,"CRC_OK" , 25,"LORA",125000,"SF12"  ,"4/5",-79, +6.5,"40B5FC9F-0900B509-025F23B9-98D2DAAD-A41568A5-2106D7CE-4C"
