[
  {
    "endIndex": 1,
    "sectionBreak": {
      "sectionStyle": {
        "columnSeparatorStyle": "NONE",
        "contentDirection": "LEFT_TO_RIGHT",
        "sectionType": "CONTINUOUS"
      }
    }
  },
  {
    "startIndex": 1,
    "endIndex": 54,
    "paragraph": {
      "elements": [
        {
          "startIndex": 1,
          "endIndex": 54,
          "textRun": {
            "content": "GRP-00: Example Documents (grp-00-example-documents)\n",
            "textStyle": {}
          }
        }
      ],
      "paragraphStyle": {
        "namedStyleType": "HEADING_1",
        "direction": "LEFT_TO_RIGHT"
      }
    }
  },
  {
    "startIndex": 54,
    "endIndex": 63,
    "paragraph": {
      "elements": [
        {
          "startIndex": 54,
          "endIndex": 63,
          "textRun": {
            "content": "Overview\n",
            "textStyle": {}
          }
        }
      ],
      "paragraphStyle": {
        "namedStyleType": "HEADING_2",
        "direction": "LEFT_TO_RIGHT"
      }
    }
  },
  {
    "startIndex": 63,
    "endIndex": 71,
    "paragraph": {
      "elements": [
        {
          "startIndex": 63,
          "endIndex": 71,
          "textRun": {
            "content": "Summary\n",
            "textStyle": {}
          }
        }
      ],
      "paragraphStyle": {
        "namedStyleType": "HEADING_3",
        "direction": "LEFT_TO_RIGHT"
      }
    }
  },
  {
    "startIndex": 71,
    "endIndex": 124,
    "paragraph": {
      "elements": [
        {
          "startIndex": 71,
          "endIndex": 124,
          "textRun": {
            "content": "Quickly assess the quality of the scans in a project\n",
            "textStyle": {}
          }
        }
      ],
      "paragraphStyle": {
        "namedStyleType": "NORMAL_TEXT",
        "direction": "LEFT_TO_RIGHT"
      }
    }
  },
  {
    "startIndex": 124,
    "endIndex": 133,
    "paragraph": {
      "elements": [
        {
          "startIndex": 124,
          "endIndex": 133,
          "textRun": {
            "content": "Citation\n",
            "textStyle": {}
          }
        }
      ],
      "paragraphStyle": {
        "namedStyleType": "HEADING_3",
        "direction": "LEFT_TO_RIGHT"
      }
    }
  },
  {
    "startIndex": 133,
    "endIndex": 146,
    "paragraph": {
      "elements": [
        {
          "startIndex": 133,
          "endIndex": 146,
          "textRun": {
            "content": "License: MIT\n",
            "textStyle": {}
          }
        }
      ],
      "paragraphStyle": {
        "namedStyleType": "NORMAL_TEXT",
        "direction": "LEFT_TO_RIGHT"
      }
    }
  },
  {
    "startIndex": 146,
    "endIndex": 203,
    "paragraph": {
      "elements": [
        {
          "startIndex": 146,
          "endIndex": 203,
          "textRun": {
            "content": "URL: https://gitlab.com\n",
            "textStyle": {}
          }
        }
      ],
      "paragraphStyle": {
        "namedStyleType": "NORMAL_TEXT",
        "direction": "LEFT_TO_RIGHT"
      }
    }
  },
  {
    "startIndex": 203,
    "endIndex": 412,
    "paragraph": {
      "elements": [
        {
          "startIndex": 203,
          "endIndex": 412,
          "textRun": {
            "content": "Cite: Someone ABC\n",
            "textStyle": {}
          }
        }
      ],
      "paragraphStyle": {
        "namedStyleType": "NORMAL_TEXT",
        "direction": "LEFT_TO_RIGHT"
      }
    }
  },
  {
    "startIndex": 412,
    "endIndex": 427,
    "paragraph": {
      "elements": [
        {
          "startIndex": 412,
          "endIndex": 427,
          "textRun": {
            "content": "Classification\n",
            "textStyle": {}
          }
        }
      ],
      "paragraphStyle": {
        "namedStyleType": "HEADING_3",
        "direction": "LEFT_TO_RIGHT"
      }
    }
  },
  {
    "startIndex": 427,
    "endIndex": 440,
    "paragraph": {
      "elements": [
        {
          "startIndex": 427,
          "endIndex": 440,
          "textRun": {
            "content": "Category: qa\n",
            "textStyle": {}
          }
        }
      ],
      "paragraphStyle": {
        "namedStyleType": "NORMAL_TEXT",
        "direction": "LEFT_TO_RIGHT"
      }
    }
  },
  {
    "startIndex": 440,
    "endIndex": 452,
    "paragraph": {
      "elements": [
        {
          "startIndex": 440,
          "endIndex": 452,
          "textRun": {
            "content": "Gear Level:\n",
            "textStyle": {}
          }
        }
      ],
      "paragraphStyle": {
        "namedStyleType": "NORMAL_TEXT",
        "direction": "LEFT_TO_RIGHT"
      }
    }
  },
  {
    "startIndex": 452,
    "endIndex": 462,
    "paragraph": {
      "elements": [
        {
          "startIndex": 452,
          "endIndex": 462,
          "textRun": {
            "content": "☐ Project\n",
            "textStyle": {}
          }
        }
      ],
      "paragraphStyle": {
        "namedStyleType": "NORMAL_TEXT",
        "direction": "LEFT_TO_RIGHT",
        "spacingMode": "NEVER_COLLAPSE",
        "indentFirstLine": {
          "magnitude": 12,
          "unit": "PT"
        },
        "indentStart": {
          "magnitude": 36,
          "unit": "PT"
        }
      },
      "bullet": {
        "listId": "kix.list.7",
        "textStyle": {}
      }
    }
  },
  {
    "startIndex": 462,
    "endIndex": 472,
    "paragraph": {
      "elements": [
        {
          "startIndex": 462,
          "endIndex": 472,
          "textRun": {
            "content": "☐ Subject\n",
            "textStyle": {}
          }
        }
      ],
      "paragraphStyle": {
        "namedStyleType": "NORMAL_TEXT",
        "direction": "LEFT_TO_RIGHT",
        "spacingMode": "NEVER_COLLAPSE",
        "indentFirstLine": {
          "magnitude": 12,
          "unit": "PT"
        },
        "indentStart": {
          "magnitude": 36,
          "unit": "PT"
        }
      },
      "bullet": {
        "listId": "kix.list.7",
        "textStyle": {}
      }
    }
  },
  {
    "startIndex": 472,
    "endIndex": 482,
    "paragraph": {
      "elements": [
        {
          "startIndex": 472,
          "endIndex": 482,
          "textRun": {
            "content": "☒ Session\n",
            "textStyle": {}
          }
        }
      ],
      "paragraphStyle": {
        "namedStyleType": "NORMAL_TEXT",
        "direction": "LEFT_TO_RIGHT",
        "spacingMode": "NEVER_COLLAPSE",
        "indentFirstLine": {
          "magnitude": 12,
          "unit": "PT"
        },
        "indentStart": {
          "magnitude": 36,
          "unit": "PT"
        }
      },
      "bullet": {
        "listId": "kix.list.7",
        "textStyle": {}
      }
    }
  },
  {
    "startIndex": 482,
    "endIndex": 496,
    "paragraph": {
      "elements": [
        {
          "startIndex": 482,
          "endIndex": 496,
          "textRun": {
            "content": "☐ Acquisition\n",
            "textStyle": {}
          }
        }
      ],
      "paragraphStyle": {
        "namedStyleType": "NORMAL_TEXT",
        "direction": "LEFT_TO_RIGHT",
        "spacingMode": "NEVER_COLLAPSE",
        "indentFirstLine": {
          "magnitude": 12,
          "unit": "PT"
        },
        "indentStart": {
          "magnitude": 36,
          "unit": "PT"
        }
      },
      "bullet": {
        "listId": "kix.list.7",
        "textStyle": {}
      }
    }
  },
  {
    "startIndex": 496,
    "endIndex": 507,
    "paragraph": {
      "elements": [
        {
          "startIndex": 496,
          "endIndex": 507,
          "textRun": {
            "content": "☐ Analysis\n",
            "textStyle": {}
          }
        }
      ],
      "paragraphStyle": {
        "namedStyleType": "NORMAL_TEXT",
        "direction": "LEFT_TO_RIGHT",
        "spacingMode": "NEVER_COLLAPSE",
        "indentFirstLine": {
          "magnitude": 12,
          "unit": "PT"
        },
        "indentStart": {
          "magnitude": 36,
          "unit": "PT"
        }
      },
      "bullet": {
        "listId": "kix.list.7",
        "textStyle": {}
      }
    }
  },
  {
    "startIndex": 507,
    "endIndex": 509,
    "paragraph": {
      "elements": [
        {
          "startIndex": 507,
          "endIndex": 508,
          "horizontalRule": {
            "textStyle": {}
          }
        },
        {
          "startIndex": 508,
          "endIndex": 509,
          "textRun": {
            "content": "\n",
            "textStyle": {}
          }
        }
      ],
      "paragraphStyle": {
        "namedStyleType": "NORMAL_TEXT",
        "direction": "LEFT_TO_RIGHT"
      }
    }
  },
  {
    "startIndex": 509,
    "endIndex": 517,
    "paragraph": {
      "elements": [
        {
          "startIndex": 509,
          "endIndex": 511,
          "textRun": {
            "content": "[[",
            "textStyle": {}
          }
        },
        {
          "startIndex": 511,
          "endIndex": 514,
          "textRun": {
            "content": "TOC",
            "textStyle": {
              "italic": true
            }
          }
        },
        {
          "startIndex": 514,
          "endIndex": 517,
          "textRun": {
            "content": "]]\n",
            "textStyle": {}
          }
        }
      ],
      "paragraphStyle": {
        "namedStyleType": "NORMAL_TEXT",
        "direction": "LEFT_TO_RIGHT"
      }
    }
  },
  {
    "startIndex": 517,
    "endIndex": 519,
    "paragraph": {
      "elements": [
        {
          "startIndex": 517,
          "endIndex": 518,
          "horizontalRule": {
            "textStyle": {}
          }
        },
        {
          "startIndex": 518,
          "endIndex": 519,
          "texrRun": {
            "content": "\n",
            "textStyle": {}
          }
        }
      ],
      "paragraphStyle": {
        "namedStyleType": "NORMAL_TEXT",
        "direction": "LEFT_TO_RIGHT"
      }
    }
  },
  {
    "startIndex": 519,
    "endIndex": 526,
    "paragraph": {
      "elements": [
        {
          "startIndex": 519,
          "endIndex": 526,
          "textRun": {
            "content": "Inputs\n",
            "textStyle": {}
          }
        }
      ],
      "paragraphStyle": {
        "namedStyleType": "HEADING_2",
        "direction": "LEFT_TO_RIGHT"
      }
    }
  },
  {
    "startIndex": 526,
    "endIndex": 532,
    "paragraph": {
      "elements": [
        {
          "startIndex": 526,
          "endIndex": 532,
          "textRun": {
            "content": "dicom\n",
            "textStyle": {}
          }
        }
      ],
      "paragraphStyle": {
        "namedStyleType": "NORMAL_TEXT",
        "direction": "LEFT_TO_RIGHT",
        "spacingMode": "NEVER_COLLAPSE",
        "indentFirstLine": {
          "magnitude": 12,
          "unit": "PT"
        },
        "indentStart": {
          "magnitude": 36,
          "unit": "PT"
        }
      },
      "bullet": {
        "listId": "kix.list.8",
        "textStyle": {}
      }
    }
  },
  {
    "startIndex": 532,
    "endIndex": 544,
    "paragraph": {
      "elements": [
        {
          "startIndex": 532,
          "endIndex": 536,
          "textRun": {
            "content": "Name",
            "textStyle": {
              "bold": true
            }
          }
        },
        {
          "startIndex": 536,
          "endIndex": 538,
          "textRun": {
            "content": ": ",
            "textStyle": {}
          }
        },
        {
          "startIndex": 538,
          "endIndex": 543,
          "textRun": {
            "content": "dicom",
            "textStyle": {
              "italic": true
            }
          }
        },
        {
          "startIndex": 543,
          "endIndex": 544,
          "textRun": {
            "content": "\n",
            "textStyle": {}
          }
        }
      ],
      "paragraphStyle": {
        "namedStyleType": "NORMAL_TEXT",
        "direction": "LEFT_TO_RIGHT",
        "spacingMode": "NEVER_COLLAPSE",
        "indentFirstLine": {
          "magnitude": 48,
          "unit": "PT"
        },
        "indentStart": {
          "magnitude": 72,
          "unit": "PT"
        }
      },
      "bullet": {
        "listId": "kix.list.9",
        "nestingLevel": 1,
        "textStyle": {}
      }
    }
  },
  {
    "startIndex": 544,
    "endIndex": 555,
    "paragraph": {
      "elements": [
        {
          "startIndex": 544,
          "endIndex": 548,
          "textRun": {
            "content": "Type",
            "textStyle": {
              "bold": true
            }
          }
        },
        {
          "startIndex": 548,
          "endIndex": 550,
          "textRun": {
            "content": ": ",
            "textStyle": {}
          }
        },
        {
          "startIndex": 550,
          "endIndex": 554,
          "textRun": {
            "content": "file",
            "textStyle": {
              "italic": true
            }
          }
        },
        {
          "startIndex": 554,
          "endIndex": 555,
          "textRun": {
            "content": "\n",
            "textStyle": {}
          }
        }
      ],
      "paragraphStyle": {
        "namedStyleType": "NORMAL_TEXT",
        "direction": "LEFT_TO_RIGHT",
        "spacingMode": "NEVER_COLLAPSE",
        "indentFirstLine": {
          "magnitude": 48,
          "unit": "PT"
        },
        "indentStart": {
          "magnitude": 72,
          "unit": "PT"
        }
      },
      "bullet": {
        "listId": "kix.list.9",
        "nestingLevel": 1,
        "textStyle": {}
      }
    }
  },
  {
    "startIndex": 555,
    "endIndex": 571,
    "paragraph": {
      "elements": [
        {
          "startIndex": 555,
          "endIndex": 563,
          "textRun": {
            "content": "Optional",
            "textStyle": {
              "bold": true
            }
          }
        },
        {
          "startIndex": 563,
          "endIndex": 565,
          "textRun": {
            "content": ": ",
            "textStyle": {}
          }
        },
        {
          "startIndex": 565,
          "endIndex": 570,
          "textRun": {
            "content": "False",
            "textStyle": {
              "italic": true
            }
          }
        },
        {
          "startIndex": 570,
          "endIndex": 571,
          "textRun": {
            "content": "\n",
            "textStyle": {}
          }
        }
      ],
      "paragraphStyle": {
        "namedStyleType": "NORMAL_TEXT",
        "direction": "LEFT_TO_RIGHT",
        "spacingMode": "NEVER_COLLAPSE",
        "indentFirstLine": {
          "magnitude": 48,
          "unit": "PT"
        },
        "indentStart": {
          "magnitude": 72,
          "unit": "PT"
        }
      },
      "bullet": {
        "listId": "kix.list.9",
        "nestingLevel": 1,
        "textStyle": {}
      }
    }
  },
  {
    "startIndex": 571,
    "endIndex": 593,
    "paragraph": {
      "elements": [
        {
          "startIndex": 571,
          "endIndex": 585,
          "textRun": {
            "content": "Classification",
            "textStyle": {
              "bold": true
            }
          }
        },
        {
          "startIndex": 585,
          "endIndex": 587,
          "textRun": {
            "content": ": ",
            "textStyle": {}
          }
        },
        {
          "startIndex": 587,
          "endIndex": 592,
          "textRun": {
            "content": "dicom",
            "textStyle": {
              "italic": true
            }
          }
        },
        {
          "startIndex": 592,
          "endIndex": 593,
          "textRun": {
            "content": "\n",
            "textStyle": {}
          }
        }
      ],
      "paragraphStyle": {
        "namedStyleType": "NORMAL_TEXT",
        "direction": "LEFT_TO_RIGHT",
        "spacingMode": "NEVER_COLLAPSE",
        "indentFirstLine": {
          "magnitude": 48,
          "unit": "PT"
        },
        "indentStart": {
          "magnitude": 72,
          "unit": "PT"
        }
      },
      "bullet": {
        "listId": "kix.list.9",
        "nestingLevel": 1,
        "textStyle": {}
      }
    }
  },
  {
    "startIndex": 593,
    "endIndex": 631,
    "paragraph": {
      "elements": [
        {
          "startIndex": 593,
          "endIndex": 604,
          "textRun": {
            "content": "Description",
            "textStyle": {
              "bold": true
            }
          }
        },
        {
          "startIndex": 604,
          "endIndex": 606,
          "textRun": {
            "content": ": ",
            "textStyle": {}
          }
        },
        {
          "startIndex": 606,
          "endIndex": 630,
          "textRun": {
            "content": "A DICOM archive (‘.zip’)",
            "textStyle": {
              "italic": true
            }
          }
        },
        {
          "startIndex": 630,
          "endIndex": 631,
          "textRun": {
            "content": "\n",
            "textStyle": {}
          }
        }
      ],
      "paragraphStyle": {
        "namedStyleType": "NORMAL_TEXT",
        "direction": "LEFT_TO_RIGHT",
        "spacingMode": "NEVER_COLLAPSE",
        "indentFirstLine": {
          "magnitude": 48,
          "unit": "PT"
        },
        "indentStart": {
          "magnitude": 72,
          "unit": "PT"
        }
      },
      "bullet": {
        "listId": "kix.list.9",
        "nestingLevel": 1,
        "textStyle": {}
      }
    }
  },
  {
    "startIndex": 631,
    "endIndex": 642,
    "paragraph": {
      "elements": [
        {
          "startIndex": 631,
          "endIndex": 636,
          "textRun": {
            "content": "Notes",
            "textStyle": {
              "bold": true
            }
          }
        },
        {
          "startIndex": 636,
          "endIndex": 638,
          "textRun": {
            "content": ": ",
            "textStyle": {}
          }
        },
        {
          "startIndex": 638,
          "endIndex": 641,
          "textRun": {
            "content": "N/A",
            "textStyle": {
              "italic": true
            }
          }
        },
        {
          "startIndex": 641,
          "endIndex": 642,
          "textRun": {
            "content": "\n",
            "textStyle": {}
          }
        }
      ],
      "paragraphStyle": {
        "namedStyleType": "NORMAL_TEXT",
        "direction": "LEFT_TO_RIGHT",
        "spacingMode": "NEVER_COLLAPSE",
        "indentFirstLine": {
          "magnitude": 48,
          "unit": "PT"
        },
        "indentStart": {
          "magnitude": 72,
          "unit": "PT"
        }
      },
      "bullet": {
        "listId": "kix.list.9",
        "nestingLevel": 1,
        "textStyle": {}
      }
    }
  },
  {
    "startIndex": 642,
    "endIndex": 656,
    "paragraph": {
      "elements": [
        {
          "startIndex": 642,
          "endIndex": 656,
          "textRun": {
            "content": "Configuration\n",
            "textStyle": {}
          }
        }
      ],
      "paragraphStyle": {
        "namedStyleType": "HEADING_3",
        "direction": "LEFT_TO_RIGHT"
      }
    }
  },
  {
    "startIndex": 656,
    "endIndex": 662,
    "paragraph": {
      "elements": [
        {
          "startIndex": 656,
          "endIndex": 661,
          "textRun": {
            "content": "debug",
            "textStyle": {
              "italic": true
            }
          }
        },
        {
          "startIndex": 661,
          "endIndex": 662,
          "textRun": {
            "content": "\n",
            "textStyle": {}
          }
        }
      ],
      "paragraphStyle": {
        "namedStyleType": "NORMAL_TEXT",
        "direction": "LEFT_TO_RIGHT",
        "spacingMode": "NEVER_COLLAPSE",
        "indentFirstLine": {
          "magnitude": 12,
          "unit": "PT"
        },
        "indentStart": {
          "magnitude": 36,
          "unit": "PT"
        }
      },
      "bullet": {
        "listId": "kix.list.10",
        "textStyle": {}
      }
    }
  },
  {
    "startIndex": 662,
    "endIndex": 674,
    "paragraph": {
      "elements": [
        {
          "startIndex": 662,
          "endIndex": 666,
          "textRun": {
            "content": "Name",
            "textStyle": {
              "bold": true
            }
          }
        },
        {
          "startIndex": 666,
          "endIndex": 668,
          "textRun": {
            "content": ": ",
            "textStyle": {}
          }
        },
        {
          "startIndex": 668,
          "endIndex": 673,
          "textRun": {
            "content": "debug",
            "textStyle": {
              "italic": true
            }
          }
        },
        {
          "startIndex": 673,
          "endIndex": 674,
          "textRun": {
            "content": "\n",
            "textStyle": {}
          }
        }
      ],
      "paragraphStyle": {
        "namedStyleType": "NORMAL_TEXT",
        "direction": "LEFT_TO_RIGHT",
        "spacingMode": "NEVER_COLLAPSE",
        "indentFirstLine": {
          "magnitude": 48,
          "unit": "PT"
        },
        "indentStart": {
          "magnitude": 72,
          "unit": "PT"
        }
      },
      "bullet": {
        "listId": "kix.list.11",
        "nestingLevel": 1,
        "textStyle": {}
      }
    }
  },
  {
    "startIndex": 674,
    "endIndex": 688,
    "paragraph": {
      "elements": [
        {
          "startIndex": 674,
          "endIndex": 678,
          "textRun": {
            "content": "Type",
            "textStyle": {
              "bold": true
            }
          }
        },
        {
          "startIndex": 678,
          "endIndex": 680,
          "textRun": {
            "content": ": ",
            "textStyle": {}
          }
        },
        {
          "startIndex": 680,
          "endIndex": 687,
          "textRun": {
            "content": "boolean",
            "textStyle": {
              "italic": true
            }
          }
        },
        {
          "startIndex": 687,
          "endIndex": 688,
          "textRun": {
            "content": "\n",
            "textStyle": {}
          }
        }
      ],
      "paragraphStyle": {
        "namedStyleType": "NORMAL_TEXT",
        "direction": "LEFT_TO_RIGHT",
        "spacingMode": "NEVER_COLLAPSE",
        "indentFirstLine": {
          "magnitude": 48,
          "unit": "PT"
        },
        "indentStart": {
          "magnitude": 72,
          "unit": "PT"
        }
      },
      "bullet": {
        "listId": "kix.list.11",
        "nestingLevel": 1,
        "textStyle": {}
      }
    }
  },
  {
    "startIndex": 688,
    "endIndex": 720,
    "paragraph": {
      "elements": [
        {
          "startIndex": 688,
          "endIndex": 699,
          "textRun": {
            "content": "Description",
            "textStyle": {
              "bold": true
            }
          }
        },
        {
          "startIndex": 699,
          "endIndex": 701,
          "textRun": {
            "content": ": ",
            "textStyle": {}
          }
        },
        {
          "startIndex": 701,
          "endIndex": 719,
          "textRun": {
            "content": "Log debug messages",
            "textStyle": {
              "italic": true
            }
          }
        },
        {
          "startIndex": 719,
          "endIndex": 720,
          "textRun": {
            "content": "\n",
            "textStyle": {}
          }
        }
      ],
      "paragraphStyle": {
        "namedStyleType": "NORMAL_TEXT",
        "direction": "LEFT_TO_RIGHT",
        "spacingMode": "NEVER_COLLAPSE",
        "indentFirstLine": {
          "magnitude": 48,
          "unit": "PT"
        },
        "indentStart": {
          "magnitude": 72,
          "unit": "PT"
        }
      },
      "bullet": {
        "listId": "kix.list.11",
        "nestingLevel": 1,
        "textStyle": {}
      }
    }
  },
  {
    "startIndex": 720,
    "endIndex": 735,
    "paragraph": {
      "elements": [
        {
          "startIndex": 720,
          "endIndex": 727,
          "textRun": {
            "content": "Default",
            "textStyle": {
              "bold": true
            }
          }
        },
        {
          "startIndex": 727,
          "endIndex": 729,
          "textRun": {
            "content": ": ",
            "textStyle": {}
          }
        },
        {
          "startIndex": 729,
          "endIndex": 734,
          "textRun": {
            "content": "false",
            "textStyle": {
              "italic": true
            }
          }
        },
        {
          "startIndex": 734,
          "endIndex": 735,
          "textRun": {
            "content": "\n",
            "textStyle": {}
          }
        }
      ],
      "paragraphStyle": {
        "namedStyleType": "NORMAL_TEXT",
        "direction": "LEFT_TO_RIGHT",
        "spacingMode": "NEVER_COLLAPSE",
        "indentFirstLine": {
          "magnitude": 48,
          "unit": "PT"
        },
        "indentStart": {
          "magnitude": 72,
          "unit": "PT"
        }
      },
      "bullet": {
        "listId": "kix.list.11",
        "nestingLevel": 1,
        "textStyle": {}
      }
    }
  },
  {
    "startIndex": 735,
    "endIndex": 752,
    "paragraph": {
      "elements": [
        {
          "startIndex": 735,
          "endIndex": 752,
          "textRun": {
            "content": "Outputs (if any)\n",
            "textStyle": {}
          }
        }
      ],
      "paragraphStyle": {
        "namedStyleType": "HEADING_2",
        "direction": "LEFT_TO_RIGHT"
      }
    }
  },
  {
    "startIndex": 752,
    "endIndex": 758,
    "paragraph": {
      "elements": [
        {
          "startIndex": 752,
          "endIndex": 758,
          "textRun": {
            "content": "Files\n",
            "textStyle": {}
          }
        }
      ],
      "paragraphStyle": {
        "namedStyleType": "HEADING_3",
        "direction": "LEFT_TO_RIGHT"
      }
    }
  },
  {
    "startIndex": 758,
    "endIndex": 769,
    "paragraph": {
      "elements": [
        {
          "startIndex": 758,
          "endIndex": 769,
          "textRun": {
            "content": "*test.csv*\n",
            "textStyle": {}
          }
        }
      ],
      "paragraphStyle": {
        "namedStyleType": "NORMAL_TEXT",
        "direction": "LEFT_TO_RIGHT",
        "spacingMode": "NEVER_COLLAPSE",
        "indentFirstLine": {
          "magnitude": 12,
          "unit": "PT"
        },
        "indentStart": {
          "magnitude": 36,
          "unit": "PT"
        }
      },
      "bullet": {
        "listId": "kix.list.14",
        "textStyle": {}
      }
    }
  },
  {
    "startIndex": 769,
    "endIndex": 786,
    "paragraph": {
      "elements": [
        {
          "startIndex": 769,
          "endIndex": 773,
          "textRun": {
            "content": "Name",
            "textStyle": {
              "bold": true
            }
          }
        },
        {
          "startIndex": 773,
          "endIndex": 786,
          "textRun": {
            "content": ": *test.csv*\n",
            "textStyle": {}
          }
        }
      ],
      "paragraphStyle": {
        "namedStyleType": "NORMAL_TEXT",
        "direction": "LEFT_TO_RIGHT",
        "spacingMode": "NEVER_COLLAPSE",
        "indentFirstLine": {
          "magnitude": 48,
          "unit": "PT"
        },
        "indentStart": {
          "magnitude": 72,
          "unit": "PT"
        }
      },
      "bullet": {
        "listId": "kix.list.15",
        "nestingLevel": 1,
        "textStyle": {}
      }
    }
  },
  {
    "startIndex": 786,
    "endIndex": 796,
    "paragraph": {
      "elements": [
        {
          "startIndex": 786,
          "endIndex": 790,
          "textRun": {
            "content": "Type",
            "textStyle": {
              "bold": true
            }
          }
        },
        {
          "startIndex": 790,
          "endIndex": 792,
          "textRun": {
            "content": ": ",
            "textStyle": {}
          }
        },
        {
          "startIndex": 792,
          "endIndex": 795,
          "textRun": {
            "content": "CSV",
            "textStyle": {
              "italic": true
            }
          }
        },
        {
          "startIndex": 795,
          "endIndex": 796,
          "textRun": {
            "content": "\n",
            "textStyle": {}
          }
        }
      ],
      "paragraphStyle": {
        "namedStyleType": "NORMAL_TEXT",
        "direction": "LEFT_TO_RIGHT",
        "spacingMode": "NEVER_COLLAPSE",
        "indentFirstLine": {
          "magnitude": 48,
          "unit": "PT"
        },
        "indentStart": {
          "magnitude": 72,
          "unit": "PT"
        }
      },
      "bullet": {
        "listId": "kix.list.15",
        "nestingLevel": 1,
        "textStyle": {}
      }
    }
  },
  {
    "startIndex": 796,
    "endIndex": 817,
    "paragraph": {
      "elements": [
        {
          "startIndex": 796,
          "endIndex": 810,
          "textRun": {
            "content": "Classification",
            "textStyle": {
              "bold": true
            }
          }
        },
        {
          "startIndex": 810,
          "endIndex": 812,
          "textRun": {
            "content": ": ",
            "textStyle": {}
          }
        },
        {
          "startIndex": 812,
          "endIndex": 816,
          "textRun": {
            "content": "file",
            "textStyle": {
              "italic": true
            }
          }
        },
        {
          "startIndex": 816,
          "endIndex": 817,
          "textRun": {
            "content": "\n",
            "textStyle": {}
          }
        }
      ],
      "paragraphStyle": {
        "namedStyleType": "NORMAL_TEXT",
        "direction": "LEFT_TO_RIGHT",
        "spacingMode": "NEVER_COLLAPSE",
        "indentFirstLine": {
          "magnitude": 48,
          "unit": "PT"
        },
        "indentStart": {
          "magnitude": 72,
          "unit": "PT"
        }
      },
      "bullet": {
        "listId": "kix.list.15",
        "nestingLevel": 1,
        "textStyle": {}
      }
    }
  },
  {
    "startIndex": 817,
    "endIndex": 854,
    "paragraph": {
      "elements": [
        {
          "startIndex": 817,
          "endIndex": 828,
          "textRun": {
            "content": "Description",
            "textStyle": {
              "bold": true
            }
          }
        },
        {
          "startIndex": 828,
          "endIndex": 830,
          "textRun": {
            "content": ": ",
            "textStyle": {}
          }
        },
        {
          "startIndex": 830,
          "endIndex": 853,
          "textRun": {
            "content": "description of the file",
            "textStyle": {
              "italic": true
            }
          }
        },
        {
          "startIndex": 853,
          "endIndex": 854,
          "textRun": {
            "content": "\n",
            "textStyle": {}
          }
        }
      ],
      "paragraphStyle": {
        "namedStyleType": "NORMAL_TEXT",
        "direction": "LEFT_TO_RIGHT",
        "spacingMode": "NEVER_COLLAPSE",
        "indentFirstLine": {
          "magnitude": 48,
          "unit": "PT"
        },
        "indentStart": {
          "magnitude": 72,
          "unit": "PT"
        }
      },
      "bullet": {
        "listId": "kix.list.15",
        "nestingLevel": 1,
        "textStyle": {}
      }
    }
  },
  {
    "startIndex": 854,
    "endIndex": 865,
    "paragraph": {
      "elements": [
        {
          "startIndex": 854,
          "endIndex": 859,
          "textRun": {
            "content": "Notes",
            "textStyle": {
              "bold": true
            }
          }
        },
        {
          "startIndex": 859,
          "endIndex": 861,
          "textRun": {
            "content": ": ",
            "textStyle": {}
          }
        },
        {
          "startIndex": 861,
          "endIndex": 864,
          "textRun": {
            "content": "N/A",
            "textStyle": {
              "italic": true
            }
          }
        },
        {
          "startIndex": 864,
          "endIndex": 865,
          "textRun": {
            "content": "\n",
            "textStyle": {}
          }
        }
      ],
      "paragraphStyle": {
        "namedStyleType": "NORMAL_TEXT",
        "direction": "LEFT_TO_RIGHT",
        "spacingMode": "NEVER_COLLAPSE",
        "indentFirstLine": {
          "magnitude": 48,
          "unit": "PT"
        },
        "indentStart": {
          "magnitude": 72,
          "unit": "PT"
        }
      },
      "bullet": {
        "listId": "kix.list.15",
        "nestingLevel": 1,
        "textStyle": {}
      }
    }
  },
  {
    "startIndex": 865,
    "endIndex": 874,
    "paragraph": {
      "elements": [
        {
          "startIndex": 865,
          "endIndex": 874,
          "textRun": {
            "content": "Metadata\n",
            "textStyle": {}
          }
        }
      ],
      "paragraphStyle": {
        "namedStyleType": "HEADING_3",
        "direction": "LEFT_TO_RIGHT"
      }
    }
  },
  {
    "startIndex": 874,
    "endIndex": 927,
    "paragraph": {
      "elements": [
        {
          "startIndex": 874,
          "endIndex": 927,
          "textRun": {
            "content": "This gear will populate some metadata at some point.\n",
            "textStyle": {}
          }
        }
      ],
      "paragraphStyle": {
        "namedStyleType": "NORMAL_TEXT",
        "direction": "LEFT_TO_RIGHT"
      }
    }
  },
  {
    "startIndex": 927,
    "endIndex": 933,
    "paragraph": {
      "elements": [
        {
          "startIndex": 927,
          "endIndex": 933,
          "textRun": {
            "content": "Usage\n",
            "textStyle": {}
          }
        }
      ],
      "paragraphStyle": {
        "namedStyleType": "HEADING_1",
        "direction": "LEFT_TO_RIGHT"
      }
    }
  },
  {
    "startIndex": 933,
    "endIndex": 974,
    "paragraph": {
      "elements": [
        {
          "startIndex": 933,
          "endIndex": 974,
          "textRun": {
            "content": "This gear implements the some algorithm.\n",
            "textStyle": {}
          }
        }
      ],
      "paragraphStyle": {
        "namedStyleType": "NORMAL_TEXT",
        "direction": "LEFT_TO_RIGHT"
      }
    }
  },
  {
    "startIndex": 974,
    "endIndex": 984,
    "paragraph": {
      "elements": [
        {
          "startIndex": 974,
          "endIndex": 984,
          "textRun": {
            "content": "Use Cases\n",
            "textStyle": {}
          }
        }
      ],
      "paragraphStyle": {
        "namedStyleType": "HEADING_2",
        "direction": "LEFT_TO_RIGHT"
      }
    }
  },
  {
    "startIndex": 984,
    "endIndex": 995,
    "paragraph": {
      "elements": [
        {
          "startIndex": 984,
          "endIndex": 995,
          "textRun": {
            "content": "Use Case 1\n",
            "textStyle": {}
          }
        }
      ],
      "paragraphStyle": {
        "namedStyleType": "HEADING_3",
        "direction": "LEFT_TO_RIGHT"
      }
    }
  },
  {
    "startIndex": 995,
    "endIndex": 1007,
    "paragraph": {
      "elements": [
        {
          "startIndex": 995,
          "endIndex": 1005,
          "textRun": {
            "content": "Conditions",
            "textStyle": {
              "bold": true
            }
          }
        },
        {
          "startIndex": 1005,
          "endIndex": 1007,
          "textRun": {
            "content": ":\n",
            "textStyle": {}
          }
        }
      ],
      "paragraphStyle": {
        "namedStyleType": "NORMAL_TEXT",
        "direction": "LEFT_TO_RIGHT"
      }
    }
  },
  {
    "startIndex": 1007,
    "endIndex": 1100,
    "paragraph": {
      "elements": [
        {
          "startIndex": 1007,
          "endIndex": 1100,
          "textRun": {
            "content": "This gear will be executed from the session container with the following gear configuration:\n",
            "textStyle": {}
          }
        }
      ],
      "paragraphStyle": {
        "namedStyleType": "NORMAL_TEXT",
        "direction": "LEFT_TO_RIGHT"
      }
    }
  },
  {
    "startIndex": 1100,
    "endIndex": 1113,
    "paragraph": {
      "elements": [
        {
          "startIndex": 1100,
          "endIndex": 1113,
          "textRun": {
            "content": "debug: false\n",
            "textStyle": {}
          }
        }
      ],
      "paragraphStyle": {
        "namedStyleType": "NORMAL_TEXT",
        "direction": "LEFT_TO_RIGHT",
        "spacingMode": "NEVER_COLLAPSE",
        "indentFirstLine": {
          "magnitude": 12,
          "unit": "PT"
        },
        "indentStart": {
          "magnitude": 36,
          "unit": "PT"
        }
      },
      "bullet": {
        "listId": "kix.list.18",
        "textStyle": {}
      }
    }
  },
  {
    "startIndex": 1113,
    "endIndex": 1114,
    "paragraph": {
      "elements": [
        {
          "startIndex": 1113,
          "endIndex": 1114,
          "textRun": {
            "content": "\n",
            "textStyle": {}
          }
        }
      ],
      "paragraphStyle": {
        "namedStyleType": "NORMAL_TEXT",
        "direction": "LEFT_TO_RIGHT",
        "indentFirstLine": {
          "magnitude": 36,
          "unit": "PT"
        },
        "indentStart": {
          "magnitude": 36,
          "unit": "PT"
        }
      }
    }
  },
  {
    "startIndex": 1114,
    "endIndex": 1200,
    "paragraph": {
      "elements": [
        {
          "startIndex": 1114,
          "endIndex": 1200,
          "autoText": {
            "content": "The gear is expected to populate metadata of the dicom header that might not be true.\n",
            "textStyle": {}
          }
        }
      ],
      "paragraphStyle": {
        "namedStyleType": "NORMAL_TEXT",
        "direction": "LEFT_TO_RIGHT"
      }
    }
  }
]
