{
  "config": {
    "initial_x_coord": 1,
    "initial_y_coord": 1.56,
    "bids_sidecar": "n",
    "coil_combine": false,
    "comment": "",
    "timezone": "CST"
  },
  "inputs": {},
  "destination": {}
}
