{
  "exchange": {
    "git-commit": "6c52031a5e759600e8c3cb60b8901900d3daf2df",
    "rootfs-hash": "sha256:084d7a0b154b9e8ae2dde8ca20c1b8038dcacd8654f5506fd88cbbad53f17b54",
    "rootfs-url": "docker://us-docker.pkg.dev/flywheel-exchange/gear-exchange/flywheel-anisotropic-diffusion-denoising:0.2.0_4.13.0"
  },
  "gear": {
    "author": "Flywheel",
    "cite": "",
    "command": "poetry run python run.py",
    "config": {
      "cond": {
        "default": 0.3,
        "description": "Conductance",
        "maximum": 1,
        "minimum": 0.1,
        "type": "number"
      },
      "iters": {
        "default": 3,
        "description": "Iterations",
        "maximum": 10,
        "minimum": 1,
        "type": "integer"
      },
      "tstep": {
        "default": 0.625,
        "description": "Time Step",
        "maximum": 1,
        "minimum": 0.1,
        "type": "number"
      }
    },
    "custom": {
      "flywheel": {
        "classification": {
          "function": [
            "Curation"
          ],
          "modality": [
            "Any"
          ],
          "organ": [
            "Brain",
            "Heart",
            "Prostate"
          ],
          "species": [
            "Animal",
            "Phantom"
          ],
          "therapeutic_area": [
            "Any"
          ]
        },
        "suite": "Curation"
      },
      "gear-builder": {
        "category": "utility",
        "image": "flywheel/anisotropic-diffusion-denoising:0.2.0_4.13.0"
      }
    },
    "description": "Gradient Anisotropic Diffusion denoising",
    "environment": {
      "FLYWHEEL": "/flywheel/v0",
      "PATH": "/opt/qt/5.15.2/gcc_64/:/opt/rh/devtoolset-4/root/usr/bin:/usr/local/sbin:/usr/local/bin:/usr/sbin:/usr/bin:/sbin:/bin:/usr/src/Slicer-build/Slicer-build/lib/Slicer-4.13/cli-modules"
    },
    "inputs": {
      "nifti-input": {
        "base": "file",
        "description": "A nifti file."
      }
    },
    "label": "Gradient Anisotropic Diffusion denoising",
    "license": "MIT",
    "maintainer": "Flywheel <support@flywheel.io>",
    "name": "anisotropic-diffusion-denoising",
    "source": "https://gitlab.com/flywheel-io/flywheel-apps/anisotropic-diffusion-denoising",
    "url": "https://gitlab.com/flywheel-io/flywheel-apps/anisotropic-diffusion-denoising",
    "version": "0.2.0_4.13.0"
  },
  "invocation-schema": {
    "$schema": "http://json-schema.org/draft-04/schema#",
    "properties": {
      "config": {
        "additionalProperties": false,
        "properties": {
          "cond": {
            "default": 0.3,
            "maximum": 1,
            "minimum": 0.1,
            "type": "number"
          },
          "iters": {
            "default": 3,
            "maximum": 10,
            "minimum": 1,
            "type": "integer"
          },
          "tstep": {
            "default": 0.625,
            "maximum": 1,
            "minimum": 0.1,
            "type": "number"
          }
        },
        "required": [
          "cond",
          "iters",
          "tstep"
        ],
        "type": "object"
      },
      "inputs": {
        "properties": {
          "nifti-input": {
            "properties": {},
            "type": "object"
          }
        },
        "required": [
          "nifti-input"
        ],
        "type": "object"
      }
    },
    "required": [
      "config",
      "inputs"
    ],
    "title": "Invocation manifest for Gradient Anisotropic Diffusion denoising",
    "type": "object"
  }
}
