{
  "author": "Flywheel",
  "cite": "",
  "command": "/flywheel/v0/run.py",
  "config": {
    "debug": {
      "default": false,
      "description": "Log debug messages",
      "type": "boolean"
    },
    "include_body_structure_resource": {
      "default": false,
      "description": "Include BodyStructure resource in the FHIR Bundle",
      "type": "boolean"
    },
    "include_encounter_resource": {
      "default": false,
      "description": "Include Encounter resource in the FHIR Bundle",
      "type": "boolean"
    }
  },
  "custom": {
    "flywheel": {
      "suite": "Curation"
    },
    "gear-builder": {
      "category": "analysis",
      "image": "flywheel/fhir-bundle-exporter:0.1.4"
    }
  },
  "description": "Export FHIR Bundles as json files ",
  "environment": {
    "FLYWHEEL": "/flywheel/v0",
    "GPG_KEY": "E3FF2839C048B25C084DEBE9B26995E310250568",
    "LANG": "C.UTF-8",
    "PATH": "/usr/local/bin:/usr/local/sbin:/usr/local/bin:/usr/sbin:/usr/bin:/sbin:/bin",
    "PWD": "/flywheel/v0",
    "PYTHON_GET_PIP_SHA256": "5aefe6ade911d997af080b315ebcb7f882212d070465df544e1175ac2be519b4",
    "PYTHON_GET_PIP_URL": "https://github.com/pypa/get-pip/raw/5eaac1050023df1f5c98b173b248c260023f2278/public/get-pip.py",
    "PYTHON_PIP_VERSION": "22.0.4",
    "PYTHON_SETUPTOOLS_VERSION": "57.5.0",
    "PYTHON_VERSION": "3.8.13"
  },
  "inputs": {
    "api-key": {
      "base": "api-key"
    }
  },
  "label": "FHIR Bundle Exporter",
  "license": "MIT",
  "maintainer": "Flywheel <support@flywheel.io>",
  "name": "fhir-bundle-exporter",
  "source": "https://gitlab.com/flywheel-io/scientific-solutions/gears/fhir-bundle-exporter",
  "url": "https://gitlab.com/flywheel-io/scientific-solutions/gears/fhir-bundle-exporter",
  "version": "0.1.4"
}
