{
  "exchange": {
    "git-commit": "6c52031a5e759600e8c3cb60b8901900d3daf2df",
    "rootfs-hash": "sha256:fccd605c7bafa756907432ac8314ce70d5daeeabea8ce3edef6fb191187da444",
    "rootfs-url": "docker://us-docker.pkg.dev/flywheel-exchange/gear-exchange/flywheel-philips-to-ismrmrd:0.1"
  },
  "gear": {
    "author": "Souheil Inati, Michael Hansen, et al.",
    "config": {
      "debug": {
        "default": false,
        "description": "Debug XML flag. The debug flag outputs the following additional files: raw.xml, processed.xml.",
        "type": "boolean"
      }
    },
    "custom": {
      "docker-image": "flywheel/philips_to_ismrmrd:v0.1",
      "flywheel": {
        "classification": {
          "function": [
            "Conversion"
          ],
          "modality": [
            "MR"
          ],
          "organ": [
            "Any"
          ],
          "species": [
            "Phantom",
            "Human",
            "Animal"
          ],
          "therapeutic_area": [
            "Any"
          ]
        },
        "suite": "Conversion"
      },
      "gear-builder": {
        "category": "converter"
      }
    },
    "description": "The Philips to ISMRM-RD Convertor (philips_to_ismrmrd v0.1.0, ismrmrd v1.3.2) is used to convert data from Philips Raw file (.raw) to ISMRM-RD raw data format (.h5).",
    "inputs": {
      "lab": {
        "base": "file",
        "description": "Input is Philips .lab file.",
        "type": {
          "enum": [
            "Philips Lab file"
          ]
        }
      },
      "raw": {
        "base": "file",
        "description": "Input is a Philips .raw file.",
        "type": {
          "enum": [
            "Philips Raw file"
          ]
        }
      },
      "sin": {
        "base": "file",
        "description": "Input is Philips .sin file.",
        "type": {
          "enum": [
            "Philips Sin file"
          ]
        }
      },
      "user_stylesheet": {
        "base": "file",
        "description": "Parameter stylesheet XSL file from user",
        "name": {
          "pattern": "^.*.xsl$"
        },
        "optional": true
      }
    },
    "label": "Philips to ISMRM-RD Converter (philips_to_ismrmrd v0.1.0, ismrmrd v1.3.2)",
    "license": "Other",
    "maintainer": "Jennifer Reiter <jenniferreiter@invenshure.com>",
    "name": "philips-to-ismrmrd",
    "source": "https://github.com/ismrmrd/philips_to_ismrmrd",
    "url": "https://github.com/flywheel-apps/philips_to_ismrmrd",
    "version": "0.1"
  },
  "invocation-schema": {
    "$schema": "http://json-schema.org/draft-04/schema#",
    "properties": {
      "config": {
        "additionalProperties": false,
        "properties": {
          "debug": {
            "default": false,
            "type": "boolean"
          }
        },
        "required": [
          "debug"
        ],
        "type": "object"
      },
      "inputs": {
        "properties": {
          "lab": {
            "properties": {
              "type": {
                "enum": [
                  "Philips Lab file"
                ]
              }
            },
            "type": "object"
          },
          "raw": {
            "properties": {
              "type": {
                "enum": [
                  "Philips Raw file"
                ]
              }
            },
            "type": "object"
          },
          "sin": {
            "properties": {
              "type": {
                "enum": [
                  "Philips Sin file"
                ]
              }
            },
            "type": "object"
          },
          "user_stylesheet": {
            "properties": {
              "name": {
                "pattern": "^.*.xsl$"
              }
            },
            "type": "object"
          }
        },
        "required": [
          "raw",
          "lab",
          "sin"
        ],
        "type": "object"
      }
    },
    "required": [
      "config",
      "inputs"
    ],
    "title": "Invocation manifest for Philips to ISMRM-RD Converter (philips_to_ismrmrd v0.1.0, ismrmrd v1.3.2)",
    "type": "object"
  }
}
