{
  "exchange": {
    "git-commit": "6c52031a5e759600e8c3cb60b8901900d3daf2df",
    "rootfs-hash": "sha256:bcb8a0c892f56b8e50bb637234feb7668206727e84a3bb17954888d09fff48e5",
    "rootfs-url": "docker://us-docker.pkg.dev/flywheel-exchange/gear-exchange/flywheel-dicom-mr-classifier:1.4.10"
  },
  "gear": {
    "author": "Michael Perry <lmperry@stanford.edu>",
    "config": {
      "force": {
        "default": false,
        "description": "Force pydicom to read the input file. This option allows files that do not adhere to the DICOM standard to be read and parsed. (Default=False)",
        "type": "boolean"
      },
      "timezone": {
        "default": "UTC",
        "description": "Time Zone to which all timestamps should be localized. This will set the default time zone in the Gear and thus localize the timestamps to that time zone. Examples: 'America/Los_Angeles', 'America/New_York'. [default = 'UTC'].",
        "type": "string"
      }
    },
    "custom": {
      "flywheel": {
        "classification": {
          "function": [
            ""
          ],
          "modality": [
            ""
          ],
          "organ": [
            ""
          ],
          "species": [
            ""
          ],
          "therapeutic_area": [
            ""
          ]
        },
        "gid": 1000,
        "suite": "",
        "uid": 1000
      },
      "gear-builder": {
        "category": "converter",
        "image": "flywheel/dicom-mr-classifier:1.4.10"
      }
    },
    "description": "Extract metadata and determine classification from raw DICOM data. Compatible with Siemens, Philips, and GE DICOMs.",
    "flywheel": "0",
    "inputs": {
      "classifications": {
        "base": "context"
      },
      "dicom": {
        "base": "file",
        "description": "Archive (.zip) containing DICOM files.",
        "type": {
          "enum": [
            "dicom"
          ]
        }
      }
    },
    "label": "SciTran: DICOM MR Classifier",
    "license": "Apache-2.0",
    "maintainer": "Michael Perry <lmperry@stanford.edu>",
    "name": "dicom-mr-classifier",
    "source": "https://github.com/flywheel-apps/dicom-mr-classifier/releases",
    "url": "https://github.com/flywheel-apps/dicom-mr-classifier",
    "version": "1.4.10"
  },
  "invocation-schema": {
    "$schema": "http://json-schema.org/draft-04/schema#",
    "properties": {
      "config": {
        "additionalProperties": false,
        "properties": {
          "force": {
            "default": false,
            "type": "boolean"
          },
          "timezone": {
            "default": "UTC",
            "type": "string"
          }
        },
        "required": [
          "timezone",
          "force"
        ],
        "type": "object"
      },
      "inputs": {
        "properties": {
          "classifications": {
            "properties": {
              "base": {
                "type": "string"
              },
              "found": {
                "type": "boolean"
              },
              "value": {}
            },
            "required": [
              "base",
              "found",
              "value"
            ],
            "type": "object"
          },
          "dicom": {
            "properties": {
              "type": {
                "enum": [
                  "dicom"
                ]
              }
            },
            "type": "object"
          }
        },
        "required": [
          "dicom",
          "classifications"
        ],
        "type": "object"
      }
    },
    "required": [
      "config",
      "inputs"
    ],
    "title": "Invocation manifest for SciTran: DICOM MR Classifier",
    "type": "object"
  }
}
