{
  "exchange": {
    "git-commit": "6c52031a5e759600e8c3cb60b8901900d3daf2df",
    "rootfs-hash": "sha256:78cd8348e8edc8ca8a7ed8b325953e1e89102a43b793e979ea93cb74c22a33ee",
    "rootfs-url": "docker://us-docker.pkg.dev/flywheel-exchange/gear-exchange/flywheel-hierarchy-curator:2.1.6"
  },
  "gear": {
    "author": "Flywheel",
    "cite": "",
    "command": "python run.py",
    "config": {
      "debug": {
        "default": false,
        "description": "Log debug messages",
        "type": "boolean"
      }
    },
    "custom": {
      "flywheel": {
        "classification": {
          "function": [
            "Curation"
          ],
          "modality": [
            "Any"
          ],
          "organ": [
            "Any"
          ],
          "species": [
            "Phantom",
            "Human",
            "Animal",
            "Other"
          ],
          "therapeutic_area": [
            "Any"
          ]
        },
        "suite": "Curation"
      },
      "gear-builder": {
        "category": "analysis",
        "image": "flywheel/hierarchy-curator:2.1.6"
      }
    },
    "description": "Curates a container in the flywheel hierarchy given a python HierarchyCurator class. Using an implementation of the HierarchyCurator Class (provided as an input file (e.g., curator.py)) this gear is able to curate an entire project, walking down the hierarchy through project, subject, session, acquisition, analysis, and file containers.",
    "environment": {
      "FLYWHEEL": "/flywheel/v0",
      "GPG_KEY": "E3FF2839C048B25C084DEBE9B26995E310250568",
      "LANG": "C.UTF-8",
      "PATH": "/usr/local/bin:/usr/local/sbin:/usr/local/bin:/usr/sbin:/usr/bin:/sbin:/bin",
      "PYTHON_GET_PIP_SHA256": "e235c437e5c7d7524fbce3880ca39b917a73dc565e0c813465b7a7a329bb279a",
      "PYTHON_GET_PIP_URL": "https://github.com/pypa/get-pip/raw/38e54e5de07c66e875c11a1ebbdb938854625dd8/public/get-pip.py",
      "PYTHON_PIP_VERSION": "22.0.4",
      "PYTHON_SETUPTOOLS_VERSION": "57.5.0",
      "PYTHON_VERSION": "3.8.13"
    },
    "inputs": {
      "additional-input-one": {
        "base": "file",
        "description": "An optional input for curation.",
        "optional": true
      },
      "additional-input-three": {
        "base": "file",
        "description": "An optional input for curation.",
        "optional": true
      },
      "additional-input-two": {
        "base": "file",
        "description": "An optional input for curation.",
        "optional": true
      },
      "api-key": {
        "base": "api-key",
        "read-only": false
      },
      "curator": {
        "base": "file",
        "description": "A python implementation of the Curator class (see https://github.com/flywheel-apps/custom-curator for more details).",
        "type": {
          "enum": [
            "source data"
          ]
        }
      }
    },
    "label": "Hierarchy Curator",
    "license": "MIT",
    "maintainer": "Flywheel <support@flywheel.io>",
    "name": "hierarchy-curator",
    "source": "https://gitlab.com/flywheel-io/scientific-solutions/gears/hierarchy-curator",
    "url": "https://gitlab.com/flywheel-io/scientific-solutions/gears/hierarchy-curator",
    "version": "2.1.6"
  },
  "invocation-schema": {
    "$schema": "http://json-schema.org/draft-04/schema#",
    "properties": {
      "config": {
        "additionalProperties": false,
        "properties": {
          "debug": {
            "default": false,
            "type": "boolean"
          }
        },
        "required": [
          "debug"
        ],
        "type": "object"
      },
      "inputs": {
        "properties": {
          "additional-input-one": {
            "properties": {},
            "type": "object"
          },
          "additional-input-three": {
            "properties": {},
            "type": "object"
          },
          "additional-input-two": {
            "properties": {},
            "type": "object"
          },
          "api-key": {
            "type": "object"
          },
          "curator": {
            "properties": {
              "type": {
                "enum": [
                  "source data"
                ]
              }
            },
            "type": "object"
          }
        },
        "required": [
          "api-key",
          "curator"
        ],
        "type": "object"
      }
    },
    "required": [
      "config",
      "inputs"
    ],
    "title": "Invocation manifest for Hierarchy Curator",
    "type": "object"
  }
}
