{
  "exchange": {
    "git-commit": "6c52031a5e759600e8c3cb60b8901900d3daf2df",
    "rootfs-hash": "sha256:203cedbd330a73fca5c09832e426976094af6234e601ec8d30902a7d1dd23243",
    "rootfs-url": "docker://us-docker.pkg.dev/flywheel-exchange/gear-exchange/flywheel-nobrainer-gear:0.1.0"
  },
  "gear": {
    "author": "Flywheel",
    "cite": "",
    "command": "/flywheel/v0/run.py",
    "config": {
      "largest-label": {
        "default": false,
        "description": "Zero out all values not connected to the largest contiguous label (not including 0 values). This remove false positives in binary prediction.",
        "type": "boolean"
      },
      "rotate-and-predict": {
        "default": false,
        "description": "Average the prediction with a prediction on a rotated (and subsequently un-rotated) volume. This can produce a better overall prediction with the expense of more time.",
        "type": "boolean"
      },
      "threshold": {
        "default": 0.3,
        "description": "Threshold used to binarize model output. Only used in binary prediction and must be in (0, 1).",
        "maximum": 1,
        "minimum": 0,
        "type": "number"
      }
    },
    "custom": {
      "docker-image": "flywheel/nobrainer:0.1.0",
      "flywheel": {
        "classification": {
          "function": [
            "Image Processing - Segmentation",
            "Image Processing - Structural"
          ],
          "modality": [
            "MR"
          ],
          "organ": [
            "Brain"
          ],
          "species": [
            "Human"
          ],
          "therapeutic_area": [
            "Neurology",
            "Psychiatry/Psychology"
          ]
        },
        "suite": "Image Processing"
      },
      "gear-builder": {
        "category": "analysis",
        "image": "flywheel/nobrainer:0.1.0"
      }
    },
    "description": "A framework for developing neural network models for 3D image processing.",
    "inputs": {
      "T1W": {
        "base": "file",
        "description": "T1-Weighted Image",
        "optional": false,
        "type": {
          "enum": [
            "nifti"
          ]
        }
      },
      "model": {
        "base": "file",
        "description": "nobrainer HDF5 Model, defaults to internally stored model. The default model is found at https://github.com/neuronets/nobrainer-models.",
        "optional": true
      }
    },
    "label": "Nobrainer",
    "license": "Other",
    "maintainer": "Flywheel <support@flywheel.io>",
    "name": "nobrainer",
    "source": "https://github.com/neuronets/nobrainer",
    "url": "https://github.com/flywheel-apps/nobrainer-gear",
    "version": "0.1.0"
  },
  "invocation-schema": {
    "$schema": "http://json-schema.org/draft-04/schema#",
    "properties": {
      "config": {
        "additionalProperties": false,
        "properties": {
          "largest-label": {
            "default": false,
            "type": "boolean"
          },
          "rotate-and-predict": {
            "default": false,
            "type": "boolean"
          },
          "threshold": {
            "default": 0.3,
            "maximum": 1,
            "minimum": 0,
            "type": "number"
          }
        },
        "required": [
          "largest-label",
          "threshold",
          "rotate-and-predict"
        ],
        "type": "object"
      },
      "inputs": {
        "properties": {
          "T1W": {
            "properties": {
              "type": {
                "enum": [
                  "nifti"
                ]
              }
            },
            "type": "object"
          },
          "model": {
            "properties": {},
            "type": "object"
          }
        },
        "required": [
          "T1W"
        ],
        "type": "object"
      }
    },
    "required": [
      "config",
      "inputs"
    ],
    "title": "Invocation manifest for Nobrainer",
    "type": "object"
  }
}
