{
  "exchange": {
    "git-commit": "6c52031a5e759600e8c3cb60b8901900d3daf2df",
    "rootfs-hash": "sha256:57fe16ec4cb35d634b5fc98bc8a853e68dfc4bfff730bcd41746c12c71195779",
    "rootfs-url": "docker://us-docker.pkg.dev/flywheel-exchange/gear-exchange/flywheel-nifti-to-mips:0.1.0"
  },
  "gear": {
    "author": "Flywheel",
    "cite": "",
    "command": "poetry run python run.py",
    "config": {
      "debug": {
        "default": false,
        "description": "Log debug messages",
        "type": "boolean"
      },
      "invert_image": {
        "default": true,
        "description": "Inversion of the output image.",
        "type": "boolean"
      },
      "threshold_percentile": {
        "default": 98.5,
        "description": "The percentile at which to threshold maximum values",
        "type": "number"
      }
    },
    "custom": {
      "flywheel": {
        "classification": {
          "function": [
            "Conversion"
          ],
          "modality": [
            "Any"
          ],
          "organ": [
            "Any"
          ],
          "species": [
            "Phantom",
            "Human",
            "Other",
            "Animal"
          ],
          "therapeutic_area": [
            "Any"
          ]
        },
        "suite": "Conversion"
      },
      "gear-builder": {
        "category": "converter",
        "image": "flywheel/nifti-to-mips:0.1.0"
      }
    },
    "description": "Convert NIfTI file into PNG images using Maximum Intensity Projection(MIP) technique",
    "environment": {},
    "inputs": {
      "nifti_input_file": {
        "base": "file",
        "description": "Any nifti file.",
        "optional": false,
        "type": {
          "enum": [
            "nifti"
          ]
        }
      }
    },
    "label": "NIFTI to MIPS",
    "license": "MIT",
    "maintainer": "Flywheel <support@flywheel.io>",
    "name": "nifti-to-mips",
    "source": "https://gitlab.com/flywheel-io/flywheel-apps/nifti-to-mips/",
    "url": "https://gitlab.com/flywheel-io/flywheel-apps/nifti-to-mips",
    "version": "0.1.0"
  },
  "invocation-schema": {
    "$schema": "http://json-schema.org/draft-04/schema#",
    "properties": {
      "config": {
        "additionalProperties": false,
        "properties": {
          "debug": {
            "default": false,
            "type": "boolean"
          },
          "invert_image": {
            "default": true,
            "type": "boolean"
          },
          "threshold_percentile": {
            "default": 98.5,
            "type": "number"
          }
        },
        "required": [
          "threshold_percentile",
          "invert_image",
          "debug"
        ],
        "type": "object"
      },
      "inputs": {
        "properties": {
          "nifti_input_file": {
            "properties": {
              "type": {
                "enum": [
                  "nifti"
                ]
              }
            },
            "type": "object"
          }
        },
        "required": [
          "nifti_input_file"
        ],
        "type": "object"
      }
    },
    "required": [
      "config",
      "inputs"
    ],
    "title": "Invocation manifest for NIFTI to MIPS",
    "type": "object"
  }
}
