{
  "exchange": {
    "git-commit": "6c52031a5e759600e8c3cb60b8901900d3daf2df",
    "rootfs-hash": "sha256:a3a1730fb1179baad6e3e6cc7e1fbd2ff2b834bd8984e28ba9719e1017edda4a",
    "rootfs-url": "docker://us-docker.pkg.dev/flywheel-exchange/gear-exchange/flywheel-mriqc:0.8.0_23.1.0"
  },
  "gear": {
    "author": "Oscar Esteban, Krzysztof F. Gorgolewski. Poldrack Lab, Psychology, CRN, Stanford University",
    "cite": "Esteban O, Birman D, Schaer M, Koyejo OO, Poldrack RA, Gorgolewski KJ; MRIQC: Advancing the Automatic Prediction of Image Quality in MRI from Unseen Sites; PLOS ONE 12(9):e0184661; doi:10.1371/journal.pone.0184661.",
    "command": "python run.py",
    "config": {
      "debug": {
        "default": false,
        "description": "Log debug messages",
        "type": "boolean"
      },
      "include_rating_widget": {
        "default": false,
        "description": "Include the MRIQC built-in rating widget (does not function in flywheel)",
        "type": "boolean"
      },
      "measurement": {
        "default": "auto-detect",
        "description": "Measurement/Intent of input image. Can be either 'T1', 'T2' or 'functional' (default='auto-detect' - gear will attempt to automatically detect the type of input image. If input does not have a classification value, making auto-detection impossible, the gear will exit).",
        "enum": [
          "auto-detect",
          "functional",
          "T1",
          "T2"
        ],
        "type": "string"
      },
      "save_derivatives": {
        "default": false,
        "description": "Save the derivative JSON file generated by MRIQC algorithm.",
        "type": "boolean"
      },
      "tag": {
        "default": "mriqc",
        "description": "Tag to add to file.",
        "type": "string"
      },
      "verbose_reports": {
        "default": false,
        "description": "Produce verbose report outputs.",
        "type": "boolean"
      }
    },
    "custom": {
      "docker-image": "flywheel/mriqc:0.8.0_23.1.0",
      "flywheel": {
        "classification": {
          "function": [
            "Quality Assurance"
          ],
          "modality": [
            "MR"
          ],
          "organ": [
            "Brain"
          ],
          "species": [
            "Human"
          ],
          "therapeutic_area": [
            "Psychiatry/Psychology",
            "Neurology"
          ]
        },
        "suite": "Quality Assurance"
      },
      "gear-builder": {
        "category": "qa",
        "image": "flywheel/mriqc:0.8.0_23.1.0"
      }
    },
    "description": "MRIQC (v23.1.0) extracts no-reference IQMs (image quality metrics) from structural (T1w and T2w) and functional MRI (magnetic resonance imaging) data. Note, this gear only supports the generation of individual scan reports; group reports are not generated. Also note, for the auto-detection config option to work for this gear, the follow gears must be run beforehand: (1) dicom-mr-classifier then (2) dcm2niix (version 0.3.1 or higher).",
    "environment": {
      "AFNI_DIR": "/opt/afni",
      "AFNI_IMSAVE_WARNINGS": "NO",
      "AFNI_MODELPATH": "/opt/afni/models",
      "AFNI_PLUGINPATH": "/opt/afni/plugins",
      "AFNI_TTATLAS_DATASET": "/opt/afni/atlases",
      "ANTSPATH": "/opt/ants",
      "CONDA_PATH": "/opt/conda",
      "CPATH": "/opt/conda/include:",
      "FLYWHEEL": "/flywheel/v0",
      "FREESURFER_HOME": "/opt/freesurfer",
      "FSLDIR": "/opt/fsl",
      "FSLGECUDAQ": "cuda.q",
      "FSLMULTIFILEQUIT": "TRUE",
      "FSLOUTPUTTYPE": "NIFTI_GZ",
      "FSLTCLSH": "/opt/fsl/bin/fsltclsh",
      "FSLWISH": "/opt/fsl/bin/fslwish",
      "IS_DOCKER_8395080871": "1",
      "LANG": "en_US.UTF-8",
      "LC_ALL": "en_US.UTF-8",
      "LD_LIBRARY_PATH": "/usr/lib/x86_64-linux-gnu:/opt/conda/lib",
      "MKL_NUM_THREADS": "1",
      "OMP_NUM_THREADS": "1",
      "PATH": "/opt/ants:/opt/afni:/opt/conda/bin:/usr/local/sbin:/usr/local/bin:/usr/sbin:/usr/bin:/sbin:/bin",
      "POSSUMDIR": "/opt/fsl",
      "PWD": "/flywheel/v0",
      "PYTHONNOUSERSITE": "1"
    },
    "inputs": {
      "api-key": {
        "base": "api-key",
        "read-only": false
      },
      "nifti": {
        "base": "file",
        "description": "MRI NIfTI file. Input can be a structural image (T1, T2) or a functional NIfTI file.",
        "type": {
          "enum": [
            "nifti"
          ]
        }
      }
    },
    "label": "MRIQC: No-reference image quality metrics for quality assessment of MRI ",
    "license": "BSD-3-Clause",
    "maintainer": "Flywheel <support@flywheel.io>",
    "name": "mriqc",
    "source": "https://github.com/nipreps/mriqc",
    "url": "https://gitlab.com/flywheel-io/scientific-solutions/gears/mriqc",
    "version": "0.8.0_23.1.0"
  },
  "invocation-schema": {
    "$schema": "http://json-schema.org/draft-04/schema#",
    "properties": {
      "config": {
        "additionalProperties": false,
        "properties": {
          "debug": {
            "default": false,
            "type": "boolean"
          },
          "include_rating_widget": {
            "default": false,
            "type": "boolean"
          },
          "measurement": {
            "default": "auto-detect",
            "enum": [
              "auto-detect",
              "functional",
              "T1",
              "T2"
            ],
            "type": "string"
          },
          "save_derivatives": {
            "default": false,
            "type": "boolean"
          },
          "tag": {
            "default": "mriqc",
            "type": "string"
          },
          "verbose_reports": {
            "default": false,
            "type": "boolean"
          }
        },
        "required": [
          "debug",
          "include_rating_widget",
          "measurement",
          "save_derivatives",
          "tag",
          "verbose_reports"
        ],
        "type": "object"
      },
      "inputs": {
        "properties": {
          "api-key": {
            "type": "object"
          },
          "nifti": {
            "properties": {
              "type": {
                "enum": [
                  "nifti"
                ]
              }
            },
            "type": "object"
          }
        },
        "required": [
          "api-key",
          "nifti"
        ],
        "type": "object"
      }
    },
    "required": [
      "config",
      "inputs"
    ],
    "title": "Invocation manifest for MRIQC: No-reference image quality metrics for quality assessment of MRI ",
    "type": "object"
  }
}
