{
	"name": "xcpengine-fw",
	"label":  "XCPENGINE: pipeline for processing of  structural and functional data.",
	"description": " The XCP imaging pipeline (XCP system) for  preprocessing of structural and functional data.",
	"version": "1.2.3",
	"inputs": {
		"antsct": {
			"base": "file",
			"description": "Structural output directory",
			"optional": true
		},
		"api_key": {
			"base": "api-key"
		},
		"contrast": {
			"base": "file",
			"description": " json file of contrasts",
			"optional": true
		},
		"designfile": {
			"base": "file",
			"description": "designfile: list all modules to run"
		},
		"eventfile": {
			"base": "file",
			"description": "event times files ",
			"optional": true
		},
		"fmriprepdir": {
			"base": "file",
			"description": "FMRIprep output directory",
			"optional": true
		},
		"img": {
			"base": "file",
			"description": "asl or structural image ",
			"optional": true
		},
		"m0": {
			"base": "file",
			"description": "M0 images for cbf calibration",
			"optional": true
		}
	},
	"config": {
		"analysis_type": {
			"default": "xcp",
			"description": " analysis type: [fc,struc,task,cbf]",
			"type": "string"
		},
		"task_name": {
			"default": "",
			"description": " name of the task to perform either task regression or task ",
			"type": "string"
		}
	},
	"author": "Ted Satterthwaite",
	"maintainer": "Ted Satterthwaite",
	"cite": "Ciric, Rastko and Rosen, Adon F. G. and Erus, Guray and Cieslak, Matthew and Adebimpe, Azeez and Cook, Philip A. and Bassett, Danielle S. and Davatzikos, Christos and Wolf, Daniel H. and Satterthwaite, Theodore D., Mitigating head motion artifact in functional connectivity MRI",
	"license": "Other",
	"source": "https://xcpengine.readthedocs.io/",
	"url": "https://github.com/PennBBL/xcpEngine",
	"custom": {
		"flywheel": {
			"suite": "PennBBL"
		},
		"gear-builder": {
			"category": "analysis",
			"image": "pennbbl/xcpengine:1.2.3"
		}
	},
	"command": "/flywheel/v0/run",
	"environment": {
		"JQPATH": "/usr/bin/",
		"LC_ALL": "C.UTF-8",
		"LD_LIBRARY_PATH": "/opt/ants-latest/lib",
		"FSLDIR": "/opt/fsl-5.0.10",
		"workbench": "/xcpEngine/thirdparty/workbench/bin_rh_linux64",
		"LANG": "C.UTF-8",
		"HOSTNAME": "302fa554c650",
		"USER": "whoami",
		"PYTHONNOUSERSITE": "1",
		"C3D_PATH": "/opt/convert3d-nightly/bin/",
		"PWD": "/flywheel/v0",
		"HOME": "/root",
		"FREESURFER_HOME": "/opt/freesurfer",
		"CPATH": "/usr/local/miniconda/include/:",
		"DEBIAN_FRONTEND": "noninteractive",
		"AFNI_PLUGINPATH": "/opt/afni-latest",
		"FLYWHEEL": "/flywheel/v0",
		"XCPEDIR": "/xcpEngine",
		"ND_ENTRYPOINT": "/neurodocker/startup.sh",
		"ANTSPATH": "/opt/ants-latest/bin",
		"AFNI_PATH": "/opt/afni-latest/",
		"SHLVL": "1",
		"PATH": "/opt/freesurfer:/xcpEngine/thirdparty/workbench/bin_rh_linux64:/opt/convert3d-nightly/bin:/opt/ants-latest/bin:/opt/afni-latest:/opt/convert3d-1.0.0/bin:/opt/fsl-5.0.10/bin:/usr/local/miniconda/bin:/usr/local/sbin:/usr/local/bin:/usr/sbin:/usr/bin:/sbin:/bin:/xcpEngine",
		"XCPENGINE_VERSION": "1.2.3",
		"C3DPATH": "/opt/convert3d-nightly"		
	}
}
