{
	"name": "fw-heudiconv",
	"label": "Flywheel HeuDiConv",
	"description": "HeuDiConv-style BIDS curation on Flywheel. Flywheel HeuDiConv (or fw-heudiconv, pronounced /fwuː di kɑː n(v)/) is a Python-based toolkit that leverages the flexibility and comprehensiveness of HeuDiConv to curate neuroimaging data on Flywheel into a BIDS-valid format.",
	"version": "0.2.16_0.4.2",
	"inputs": {
		"api_key": {
			"base": "api-key"
		},
		"heuristic": {
			"base": "file",
			"description": "Python file implementing a heudiconv heuristic",
			"optional": true
		}
	},
	"config": {
		"action": {
			"default": "Curate",
			"description": "Curate: Apply heuristic to project. Export: Create zip of BIDS tree. Tabulate: Create a table of sequence information in a project. Clear: Clear BIDS data from project. Reproin Check: Apply the reproin heuristic to a list of reproin names to check for validity. Meta: Autogenerate BIDS metadata for project.",
			"type": "string",
			"enum": ["Curate", "Export", "Tabulate", "Clear", "Reproin", "Validate"]
		},
		"dry_run": {
			"default": true,
			"description": "Run without applying changes",
			"type": "boolean"
		}
	},
	"command": "./fw_heudiconv_run.py",
	"author": "Tinashe Michael Tapera",
	"maintainer": "Tinashe Michael Tapera",
	"cite": "",
	"license": "Other",
	"source": "https://github.com/PennBBL/fw-heudiconv/wiki",
	"url": "https://github.com/PennBBL/fw-heudiconv",
	"custom": {
		"gear-builder": {
			"category": "analysis",
			"image": "pennbbl/fw-heudiconv:0.2.16_0.4.2"
		},
		"flywheel":{"suite": "PennBBL"}
	}
}