{
  "author": "Flywheel",
  "cite": "",
  "command": "python run.py",
  "config": {
    "debug": {
      "default": false,
      "description": "Log debug messages",
      "type": "boolean"
    },
    "report-on-success": {
      "default": false,
      "type": "boolean",
      "description": "If true, report on QC results that passed as well. Otherwise, report on only failed QC results."
    },
    "output-format": {
      "default": "csv",
      "type": "string",
      "description": "Format of output report.",
      "enum": [
        "csv",
        "json"
      ]
    },
    "intermediate-containers": {
      "default": false,
      "type": "boolean",
      "description": "If true, report on files attached to all containers under the run level. Otherwise only report on files attached to acquisition."
    },
    "skip-analyses": {
      "default": true,
      "type": "boolean",
      "description": "If true, skip analysis QC results. Otherwise include analyses"
    }
  },
  "custom": {
    "flywheel": {
      "suite": "Report",
      "show-job": true,
      "classification": {
        "function": [
          "Report"
        ]
      }
    },
    "gear-builder": {
      "category": "analysis",
      "image": "flywheel/qc-reporter:0.3.3"
    }
  },
  "description": "Gear to create report on qc values from metadata on various sections of the hierarchy.",
  "environment": {
    "PYTHON_PIP_VERSION": "22.0.4",
    "GPG_KEY": "7169605F62C751356D054A26A821E680E5FA6305",
    "FLYWHEEL": "/flywheel/v0",
    "PYTHON_GET_PIP_URL": "https://github.com/pypa/get-pip/raw/d5cb0afaf23b8520f1bbcfed521017b4a95f5c01/public/get-pip.py",
    "PATH": "/usr/local/bin:/usr/local/sbin:/usr/local/bin:/usr/sbin:/usr/bin:/sbin:/bin",
    "LANG": "C.UTF-8",
    "PYTHON_VERSION": "3.12.7",
    "PYTHON_SETUPTOOLS_VERSION": "57.5.0",
    "PWD": "/flywheel/v0",
    "PYTHON_GET_PIP_SHA256": "394be00f13fa1b9aaa47e911bdb59a09c3b2986472130f30aa0bfaf7f3980637",
    "PYTHON_SHA256": "24887b92e2afd4a2ac602419ad4b596372f67ac9b077190f459aba390faf5550"
  },
  "inputs": {
    "metadata-rules": {
      "base": "file",
      "description": "A YAML file describing how to handle non-default QC values.",
      "optional": true,
      "type": {
        "enum": [
          "source code"
        ]
      }
    },
    "api-key": {
      "base": "api-key",
      "read-only": true
    }
  },
  "label": "QC Reporter",
  "license": "MIT",
  "maintainer": "Flywheel <support@flywheel.io>",
  "name": "qc-reporter",
  "source": "https://gitlab.com/flywheel-io/scientific-solutions/gears/qc-reporter",
  "url": "https://gitlab.com/flywheel-io/scientific-solutions/gears/qc-reporter",
  "version": "0.3.3"
}
