{
  "exchange": {
    "git-commit": "6c52031a5e759600e8c3cb60b8901900d3daf2df",
    "rootfs-hash": "sha256:a9bb159b661b68bd86b3bee22b11aba9e1d476eb2ba5397306cc56423cef7b32",
    "rootfs-url": "docker://us-docker.pkg.dev/flywheel-exchange/gear-exchange/flywheel-roi2nix:1.0.3"
  },
  "gear": {
    "author": "Flywheel",
    "cite": "",
    "command": "poetry run python3 /flywheel/v0/run.py",
    "config": {
      "conversion_method": {
        "default": "dcm2niix",
        "enum": [
          "dcm2niix",
          "slicer-dcmtk",
          "slicer-gdcm",
          "slicer-arch",
          "plastimatch",
          "dicom2nifti"
        ],
        "type": "string"
      },
      "save_NRRD": {
        "default": false,
        "description": "Saves the ROI's as output Type NRRD instead of Nifti.  Default False",
        "type": "boolean"
      },
      "save_binary_masks": {
        "default": true,
        "description": " Saves individually labeled ROIs as binary masks. Otherwise use bitmasked values (sums of powers of two). Default is True.",
        "type": "boolean"
      },
      "save_combined_output": {
        "default": false,
        "description": "Saves all ROIs in a single bitmasked file. If less than 2 ROIs exists, then this has no effect. Default is False.",
        "type": "boolean"
      },
      "save_slicer_color_table": {
        "default": false,
        "description": "Saves a 3D Slicer colortable file for 3D Slicer integration. Default is False.",
        "type": "boolean"
      }
    },
    "custom": {
      "flywheel": {
        "classification": {
          "function": [
            "Conversion"
          ],
          "modality": [
            "Any"
          ],
          "organ": [
            "Any"
          ],
          "species": [
            "Phantom",
            "Human",
            "Animal",
            "Other"
          ],
          "therapeutic_area": [
            "Any"
          ]
        },
        "suite": "Conversion"
      },
      "gear-builder": {
        "category": "analysis",
        "image": "flywheel/roi2nix:1.0.3"
      }
    },
    "description": "This gear converts ROIs created in Flywheel's OHIF viewer to NIfTI files.",
    "environment": {
      "CONVERTER_DIR": "/flywheel/v0/converters",
      "CXX": "/usr/bin/gcc",
      "DCM2NIIX_DIR": "/flywheel/v0/converters/dcm2niix",
      "DCMCOMMIT": "003f0d19f1e57b0129c9dcf3e653f51ca3559028",
      "DCMHEAT_DIR": "/flywheel/v0/dcmheat",
      "DEBIAN_FRONTEND": "noninteractive",
      "DICOM2NIFTI_DIR": "/flywheel/v0/converters/dicom2nifti",
      "FLYWHEEL": "/flywheel/v0",
      "HOME": "/root",
      "OJ_VERSION": "2.4.0",
      "OPENJPEGDIR": "/flywheel/v0/openjpeg",
      "PATH": "/flywheel/v0/converters/slicer/slicer:/usr/local/sbin:/usr/local/bin:/usr/sbin:/usr/bin:/sbin:/bin",
      "PLASTIMATCH_DIR": "/flywheel/v0/converters/plastimatch",
      "SCRIPT_DIR": "/flywheel/v0/converters/scripts",
      "SHLVL": "1",
      "SLICER_DIR": "/flywheel/v0/converters/slicer",
      "SLICER_DOCKER_DIR": "/flywheel/v0/converters/slicer_docker",
      "SLICER_URL": "http://download.slicer.org/bitstream/60add706ae4540bf6a89bf98",
      "TERM": "xterm",
      "XDG_RUNTIME_DIR": "/tmp/runtime-sliceruser",
      "_": "/usr/bin/env"
    },
    "inputs": {
      "Input_File": {
        "base": "file",
        "description": "NIfTI or DICOM file with ROI drawn in OHIF Viewer (Required).",
        "optional": false,
        "type": {
          "enum": [
            "nifti",
            "dicom"
          ]
        }
      },
      "api-key": {
        "base": "api-key",
        "read-only": false
      }
    },
    "label": "ROI to NIfTI",
    "license": "MIT",
    "maintainer": "Flywheel <support@flywheel.io>",
    "name": "roi2nix",
    "source": "",
    "url": "https://gitlab.com/flywheel-io/flywheel-apps/roi2nix",
    "version": "1.0.3"
  },
  "invocation-schema": {
    "$schema": "http://json-schema.org/draft-04/schema#",
    "properties": {
      "config": {
        "additionalProperties": false,
        "properties": {
          "conversion_method": {
            "default": "dcm2niix",
            "enum": [
              "dcm2niix",
              "slicer-dcmtk",
              "slicer-gdcm",
              "slicer-arch",
              "plastimatch",
              "dicom2nifti"
            ],
            "type": "string"
          },
          "save_NRRD": {
            "default": false,
            "type": "boolean"
          },
          "save_binary_masks": {
            "default": true,
            "type": "boolean"
          },
          "save_combined_output": {
            "default": false,
            "type": "boolean"
          },
          "save_slicer_color_table": {
            "default": false,
            "type": "boolean"
          }
        },
        "required": [
          "save_NRRD",
          "save_binary_masks",
          "save_combined_output",
          "save_slicer_color_table",
          "conversion_method"
        ],
        "type": "object"
      },
      "inputs": {
        "properties": {
          "Input_File": {
            "properties": {
              "type": {
                "enum": [
                  "nifti",
                  "dicom"
                ]
              }
            },
            "type": "object"
          },
          "api-key": {
            "type": "object"
          }
        },
        "required": [
          "api-key",
          "Input_File"
        ],
        "type": "object"
      }
    },
    "required": [
      "config",
      "inputs"
    ],
    "title": "Invocation manifest for ROI to NIfTI",
    "type": "object"
  }
}
