{
  "name": "fsl-sienax",
  "label": "FSL: SIENAX - Brain tissue volume, normalised for subject head size",
  "description": "FSL's SIENAX. Sienax estimates total brain tissue volume, from a single image, normalised for skull size. It calls a series of FSL programs: It first strips non-brain tissue, and then uses the brain and skull images to estimate the scaling between the subject's image and standard space. It then runs tissue segmentation to estimate the volume of brain tissue, and multiplies this by the estimated scaling factor, to reduce head-size-related variability between subjects. Inputs should be structural image (T1-weighted, T2-weighted, PD, etc) where the in-plane resolution is better than 2mm (ideally 1mm). Outputs consist of an archive containing the results of the analysis, as well as an HTML report summarizing the analysis findings. LICENSING NOTE: FSL software are owned by Oxford University Innovation and license is required for any commercial applications. For commercial licence please contact fsl@innovation.ox.ac.uk. For academic use, an academic license is required which is available by registering on the FSL website. Any use of the software requires that the user obtain the appropriate license. See https://fsl.fmrib.ox.ac.uk/fsldownloads_registration for more information.",
  "author": "Analysis Group, FMRIB, Oxford, UK.",
  "maintainer": "Flywheel <support@flywheel.io>",
  "license": "Other",
  "cite": "S.M. Smith, Y. Zhang, M. Jenkinson, J. Chen, P.M. Matthews, A. Federico, and N. De Stefano. Accurate, robust and automated longitudinal and cross-sectional brain change analysis. NeuroImage, 17(1):479-489, 2002.  S.M. Smith, M. Jenkinson, M.W. Woolrich, C.F. Beckmann, T.E.J. Behrens, H. Johansen-Berg, P.R. Bannister, M. De Luca, I. Drobnjak, D.E. Flitney, R. Niazy, J. Saunders, J. Vickers, Y. Zhang, N. De Stefano, J.M. Brady, and P.M. Matthews. Advances in functional and structural MR image analysis and implementation as FSL. NeuroImage, 23(S1):208-219, 2004.",
  "version": "1.0.2_5.0",
  "inputs": {
    "api-key": {
      "base": "api-key",
      "read-only": true
    },
    "NIFTI": {
      "base": "file",
      "optional": false,
      "description": "Structural NIfTI file to be processed.",
      "type": {
        "enum": [
          "nifti"
        ]
      }
    },
    "lesion_mask": {
      "base": "file",
      "optional": true,
      "description": "an optional lesion (or lesion+CSF) mask to remove incorrectly labelled \"grey matter\" voxels",
      "type": {
        "enum": [
          "nifti"
        ]
      }
    }
  },
  "config": {
    "BET": {
      "default": "",
      "description": "bet options",
      "id": "-B",
      "type": "string"
    },
    "BOTTOM": {
      "default": "",
      "description": "ignore from b (mm) upwards in MNI152/Talairach space [default=false]",
      "id": "-b",
      "type": "string"
    },
    "DEBUG": {
      "default": false,
      "description": "debug (don't delete intermediate files) [default=false]",
      "id": "-d",
      "type": "boolean"
    },
    "SEG": {
      "default": false,
      "description": "two-class segmentation (don't segment grey and white matter separately) - use this if there is poor grey/white contrast [default=false]",
      "id": "-2",
      "type": "boolean"
    },
    "S_FAST": {
      "default": "",
      "description": "if you want to change the segmentation defaults, put FAST options inside double-quotes after using the -S flag. For example, to increase the number of segmentation iterations use: -S \"-i 20\"",
      "id": "-S",
      "type": "string"
    },
    "T2": {
      "default": false,
      "description": "tell FAST that the input images are T2-weighted and not T1 [default=false]",
      "id": "-t2",
      "type": "boolean"
    },
    "TOP": {
      "default": "",
      "description": "ignore from t (mm) upwards in MNI152/Talairach space [default=false]",
      "id": "-t",
      "type": "string"
    },
    "REGIONAL": {
      "default": false,
      "description": "tell SIENAX to estimate \"regional\" volumes as well as global; this produces peripheral cortex GM volume (3-class segmentation only) and ventricular CSF volume [default=false]",
      "id": "-r",
      "type": "boolean"
    }
  },
  "source": "https://fsl.fmrib.ox.ac.uk/fsl/fslwiki/SIENA",
  "custom": {
    "flywheel": {
      "suite": "Image Processing",
      "classification": {
        "species": [
          "Animal",
          "Human"
        ],
        "organ": [
          "Brain"
        ],
        "therapeutic_area": [
          "Neurology",
          "Psychiatry/Psychology"
        ],
        "modality": [
          "MR"
        ],
        "function": [
          "Image Processing - Structural"
        ]
      }
    },
    "gear-builder": {
      "category": "analysis",
      "image": "flywheel/fsl-sienax:1.0.2_5.0"
    }
  },
  "environment": {
    "FSLBROWSER": "/etc/alternatives/x-www-browser",
    "FSLDIR": "/usr/share/fsl/5.0",
    "FSLLOCKDIR": "",
    "FSLMACHINELIST": "",
    "FSLMULTIFILEQUIT": "TRUE",
    "FSLOUTPUTTYPE": "NIFTI_GZ",
    "FSLREMOTECALL": "",
    "FSLTCLSH": "/usr/bin/tclsh",
    "FSLWISH": "/usr/bin/wish",
    "LD_LIBRARY_PATH": "/usr/lib/fsl/5.0",
    "PATH": "/usr/lib/fsl/5.0:/usr/local/sbin:/usr/local/bin:/usr/sbin:/usr/bin:/sbin:/bin",
    "POSSUMDIR": "/usr/share/fsl/5.0"
  },
  "command": "python3 run.py",
  "url": "https://github.com/flywheel-apps/fsl-siena-sienax/tree/master/fsl-sienax"
}
