{
  "exchange": {
    "git-commit": "a11dad8386cbce70e1f245d50919588788fdbace",
    "rootfs-hash": "sha256:129506ebae39142f9f2c169c8974c43afa6b29784e8942fccbdfcef36976a4f4",
    "rootfs-url": "docker://us-docker.pkg.dev/flywheel-exchange/gear-exchange/flywheel-qc-reporter:0.3.2"
  },
  "gear": {
    "author": "Flywheel",
    "cite": "",
    "command": "python run.py",
    "config": {
      "debug": {
        "default": false,
        "description": "Log debug messages",
        "type": "boolean"
      },
      "intermediate-containers": {
        "default": false,
        "description": "If true, report on files attached to all containers under the run level. Otherwise only report on files attached to acquisition.",
        "type": "boolean"
      },
      "output-format": {
        "default": "csv",
        "description": "Format of output report.",
        "enum": [
          "csv",
          "json"
        ],
        "type": "string"
      },
      "report-on-success": {
        "default": false,
        "description": "If true, report on QC results that passed as well. Otherwise, report on only failed QC results.",
        "type": "boolean"
      },
      "skip-analyses": {
        "default": true,
        "description": "If true, skip analysis QC results. Otherwise include analyses",
        "type": "boolean"
      }
    },
    "custom": {
      "flywheel": {
        "classification": {
          "function": [
            "Report"
          ]
        },
        "show-job": true,
        "suite": "Report"
      },
      "gear-builder": {
        "category": "analysis",
        "image": "flywheel/qc-reporter:0.3.2"
      }
    },
    "description": "Gear to create report on qc values from metadata on various sections of the hierarchy.",
    "environment": {
      "FLYWHEEL": "/flywheel/v0",
      "GPG_KEY": "7169605F62C751356D054A26A821E680E5FA6305",
      "LANG": "C.UTF-8",
      "PATH": "/usr/local/bin:/usr/local/sbin:/usr/local/bin:/usr/sbin:/usr/bin:/sbin:/bin",
      "PWD": "/flywheel/v0",
      "PYTHON_GET_PIP_SHA256": "394be00f13fa1b9aaa47e911bdb59a09c3b2986472130f30aa0bfaf7f3980637",
      "PYTHON_GET_PIP_URL": "https://github.com/pypa/get-pip/raw/d5cb0afaf23b8520f1bbcfed521017b4a95f5c01/public/get-pip.py",
      "PYTHON_PIP_VERSION": "22.0.4",
      "PYTHON_SETUPTOOLS_VERSION": "57.5.0",
      "PYTHON_SHA256": "24887b92e2afd4a2ac602419ad4b596372f67ac9b077190f459aba390faf5550",
      "PYTHON_VERSION": "3.12.7"
    },
    "inputs": {
      "api-key": {
        "base": "api-key",
        "read-only": true
      },
      "metadata-rules": {
        "base": "file",
        "description": "A YAML file describing how to handle non-default QC values.",
        "optional": true,
        "type": {
          "enum": [
            "source code"
          ]
        }
      }
    },
    "label": "QC Reporter",
    "license": "MIT",
    "maintainer": "Flywheel <support@flywheel.io>",
    "name": "qc-reporter",
    "source": "https://gitlab.com/flywheel-io/scientific-solutions/gears/qc-reporter",
    "url": "https://gitlab.com/flywheel-io/scientific-solutions/gears/qc-reporter",
    "version": "0.3.2"
  },
  "invocation-schema": {
    "$schema": "http://json-schema.org/draft-04/schema#",
    "properties": {
      "config": {
        "additionalProperties": false,
        "properties": {
          "debug": {
            "default": false,
            "type": "boolean"
          },
          "intermediate-containers": {
            "default": false,
            "type": "boolean"
          },
          "output-format": {
            "default": "csv",
            "enum": [
              "csv",
              "json"
            ],
            "type": "string"
          },
          "report-on-success": {
            "default": false,
            "type": "boolean"
          },
          "skip-analyses": {
            "default": true,
            "type": "boolean"
          }
        },
        "required": [
          "debug",
          "report-on-success",
          "output-format",
          "intermediate-containers",
          "skip-analyses"
        ],
        "type": "object"
      },
      "inputs": {
        "properties": {
          "api-key": {
            "type": "object"
          },
          "metadata-rules": {
            "properties": {
              "type": {
                "enum": [
                  "source code"
                ]
              }
            },
            "type": "object"
          }
        },
        "required": [
          "api-key"
        ],
        "type": "object"
      }
    },
    "required": [
      "config",
      "inputs"
    ],
    "title": "Invocation manifest for QC Reporter",
    "type": "object"
  }
}
