{
  "name": "mrtrix3preproc",
  "label": "MRtrix3: Preprocessing Pipeline",
  "description": "mrtrix3preproc runs the MRtrix3 preprocessing pipeline. It uses FSL's topup when the optional inverse phase encoded data are provided, otherwise the pipeline uses FSL's eddy tool. The pipeline can also perform de-noising, reslicing, and alignment to an anatomical image. Required inputs are diffusion NIfTI, BVEC, BVAL, and Anatomical (ACPC aligned) NIfTI. LICENSING NOTE: FSL software are owned by Oxford University Innovation and license is required for any commercial applications. For commercial licence please contact fsl@innovation.ox.ac.uk. For academic use, an academic license is required which is available by registering on the FSL website. Any use of the software requires that the user obtain the appropriate license. See https://fsl.fmrib.ox.ac.uk/fsldownloads_registration for more information.",
  "maintainer": "Garikoitz Lerma-Usabiaga <glerma@stanford.edu>",
  "author": "MRtrix, FSL, and Brain-Life teams.",
  "url": "https://github.com/scitran-apps/mrtrix3preproc",
  "source": "https://mrtrix.readthedocs.io/en/3.0_rc3/reference/scripts/dwipreproc.html#dwipreproc",
  "license": "Other",
  "cite": "Gear adapted from https://github.com/brain-life/app-mrtrix3-preproc. Ref: https://mrtrix.readthedocs.io/en/latest/reference/scripts/dwipreproc.html#references",
  "version": "1.0.2",
  "custom": {
    "docker-image": "scitran/mrtrix3preproc:1.0.2",
    "flywheel": {
      "suite": "Image Processing",
      "classification": {
        "species": [
          "Human"
        ],
        "organ": [
          "Brain"
        ],
        "therapeutic_area": [
          "Neurology"
        ],
        "modality": [
          "MR"
        ],
        "function": [
          "Image Processing - Diffusion"
        ]
      }
    },
    "gear-builder": {
      "category": "analysis"
    }
  },
  "config": {
    "rpe": {
      "description": "Specify if there are reverse phase encoded data. Options are 'none', 'header', 'pairs', 'all'. [default=none]",
      "default": "none",
      "type": "string"
    },
    "acqd": {
      "description": "Acquisition phase encoding direction [default=PA]",
      "default": "PA",
      "type": "string"
    },
    "denoise": {
      "description": "Denoise data using PCA [default=true]",
      "default": true,
      "type": "boolean"
    },
    "degibbs": {
      "description": "Perform Gibbs ringing correction  [default=true]",
      "default": true,
      "type": "boolean"
    },
    "eddy": {
      "description": "Perform eddy current correction. If inverted phase encoding direction files are found, eddy will be done as part of topup. [default=true]",
      "default": true,
      "type": "boolean"
    },
    "bias": {
      "description": "Compute bias correction with ANTs on dwi data [default=true]",
      "default": true,
      "type": "boolean"
    },
    "ricn": {
      "description": "Perform Rician background noise removal [default=true]",
      "default": true,
      "type": "boolean"
    },
    "norm": {
      "description": "Perform intensity normalization of dwi data [default=false]",
      "default": false,
      "type": "boolean"
    },
    "nval": {
      "description": "Normalize the intensity of the FA white matter mask to this number [default=1000]",
      "default": 1000,
      "type": "number"
    },
    "acpc": {
      "description": "Align dwi data with AC-PC anatomy [default=false]",
      "default": false,
      "type": "boolean"
    },
    "doreslice": {
      "description": "Do reslicing [default=false]",
      "default": false,
      "type": "boolean",
      "id": "-doreslice"
    },
    "reslice": {
      "description": "Optional. By default reslicing is not done. If you want it done, set doreslice=true and set a number (e.g., 1) here to reslice the dwi data to this isotropic voxel size (in mm).",
      "optional": true,
      "type": "number"
    }
  },
  "inputs": {
    "DIFF": {
      "description": "Diffusion NIfTI image.",
      "base": "file",
      "type": {
        "enum": [
          "nifti"
        ]
      }
    },
    "BVAL": {
      "description": "BVAL file.",
      "base": "file",
      "type": {
        "enum": [
          "bval"
        ]
      }
    },
    "BVEC": {
      "description": "BVEC file.",
      "base": "file",
      "type": {
        "enum": [
          "bvec"
        ]
      }
    },
    "ANAT": {
      "description": "Optional anatomical T1w NIfTI image. Required only if acpc=true",
      "base": "file",
      "optional": true,
      "type": {
        "enum": [
          "nifti"
        ]
      }
    },
    "RDIF": {
      "description": "Optional reverse phase encoded (rpe) diffusion NIfTI image.",
      "base": "file",
      "optional": true,
      "type": {
        "enum": [
          "nifti"
        ]
      }
    },
    "RBVL": {
      "description": "Optional reverse phase encoded (rpe) BVAL file.",
      "base": "file",
      "optional": true,
      "type": {
        "enum": [
          "bval"
        ]
      }
    },
    "RBVC": {
      "description": "Optional reverse phase encoded (rpe) BVEC file.",
      "base": "file",
      "optional": true,
      "type": {
        "enum": [
          "bvec"
        ]
      }
    }
  }
}