{
  "exchange": {
    "git-commit": "6c52031a5e759600e8c3cb60b8901900d3daf2df",
    "rootfs-hash": "sha256:844a389cf0aee15c8947f704df96285ef2f5921e52d831b2e82e5964e9d38353",
    "rootfs-url": "docker://us-docker.pkg.dev/flywheel-exchange/gear-exchange/flywheel-openslide:0.0.1_1.1.1"
  },
  "gear": {
    "author": "Adam Goode, M. Satyanarayanan, Carnegie Mellon University <https://openslide.org/>",
    "command": "python run.py",
    "config": {
      "gear-log-level": {
        "default": "INFO",
        "description": "Gear Log verbosity level (ERROR|WARNING|INFO|DEBUG)",
        "enum": [
          "ERROR",
          "WARNING",
          "INFO",
          "DEBUG"
        ],
        "type": "string"
      }
    },
    "custom": {
      "docker-image": "flywheel/openslide-to-png:0.0.1_1.1.1",
      "flywheel": {
        "classification": {
          "function": [
            "Conversion"
          ],
          "modality": [
            "Other"
          ],
          "organ": [
            "Any"
          ],
          "species": [
            "Human",
            "Animal"
          ],
          "therapeutic_area": [
            "Any"
          ]
        },
        "suite": "Conversion"
      },
      "gear-builder": {
        "category": "converter",
        "image": "flywheel/openslide-to-png:0.0.1_1.1.1"
      }
    },
    "description": "OpenSlide: Uses the OpenSlide library to convert whole-slide image files to .png for viewing in Flywheel. Supported file types include Aperio (.svs, .tif), Hamamatsu (.ndpi, .vms, .vmu), Leica (.scn), MIRAX (.mrxs), Philips (.tiff), Sakura (.svslide), Trestle (.tif), Ventana (.bif, .tif), Generic tiled TIFF (.tif)",
    "inputs": {
      "image": {
        "base": "file",
        "description": "slide image file (.svs .tif .tiff .ndpi .vms .vmu .scn .mrxs .svslide .bif)",
        "optional": false
      }
    },
    "label": "OpenSlide to PNG file converter",
    "license": "MIT",
    "maintainer": "Flywheel <support@flywheel.io>",
    "name": "openslide-to-png",
    "source": "https://github.com/openslide/openslide-python",
    "url": "https://github.com/flywheel-apps/openslide-to-png",
    "version": "0.0.1_1.1.1"
  },
  "invocation-schema": {
    "$schema": "http://json-schema.org/draft-04/schema#",
    "properties": {
      "config": {
        "additionalProperties": false,
        "properties": {
          "gear-log-level": {
            "default": "INFO",
            "enum": [
              "ERROR",
              "WARNING",
              "INFO",
              "DEBUG"
            ],
            "type": "string"
          }
        },
        "required": [
          "gear-log-level"
        ],
        "type": "object"
      },
      "inputs": {
        "properties": {
          "image": {
            "properties": {},
            "type": "object"
          }
        },
        "required": [
          "image"
        ],
        "type": "object"
      }
    },
    "required": [
      "config",
      "inputs"
    ],
    "title": "Invocation manifest for OpenSlide to PNG file converter",
    "type": "object"
  }
}
