{
  "exchange": {
    "git-commit": "6c52031a5e759600e8c3cb60b8901900d3daf2df",
    "rootfs-hash": "sha256:a6da92792684fb3c4557a8f0d5b8b4b88fa2c724fc8f592c8a4a2b34cb563f2b",
    "rootfs-url": "docker://us-docker.pkg.dev/flywheel-exchange/gear-exchange/flywheel-siemens-to-ismrmrd:0.1"
  },
  "gear": {
    "author": "Souheil Inati, Michael Hansen, et al.",
    "config": {
      "debug": {
        "default": false,
        "description": "Debug XML flag. The debug flag outputs the following additional files: xml_raw.xml, processed.xml, config_buffer.xprot.",
        "type": "boolean"
      },
      "measNum": {
        "default": 1,
        "description": "Measurement number. Value used in the case of input VD file that contains multiple measurements.",
        "type": "integer"
      }
    },
    "custom": {
      "docker-image": "flywheel/siemens_to_ismrmrd:v0.1",
      "flywheel": {
        "classification": {
          "function": [
            "Conversion"
          ],
          "modality": [
            "MR"
          ],
          "organ": [
            "Any"
          ],
          "species": [
            "Phantom",
            "Human",
            "Animal",
            "Other"
          ],
          "therapeutic_area": [
            "Any"
          ]
        },
        "suite": "Conversion"
      },
      "gear-builder": {
        "category": "converter"
      }
    },
    "description": "The Siemens to ISMRM-RD Converter (siemens_to_ismrmrd v1.0.1, ismrmrd v1.3.2) is used to convert data from Siemens raw data format (.dat) to ISMRM-RD raw data format (.h5).",
    "inputs": {
      "dat": {
        "base": "file",
        "description": "Input is a Siemens dat file. Dat file can be a VB file or a VD file. In case of VD file that contains multiple measurements, the user can specify which measurement to convert by using the config option 'measNum'.",
        "type": {
          "enum": [
            "Siemens MR Raw"
          ]
        }
      },
      "user_map": {
        "base": "file",
        "description": "Parameter map XML file.",
        "name": {
          "pattern": "^.*.xml$"
        },
        "optional": true
      },
      "user_stylesheet": {
        "base": "file",
        "description": "Parameter stylesheet XSL file.",
        "name": {
          "pattern": "^.*.xsl$"
        },
        "optional": true
      }
    },
    "label": "Siemens to ISMRM-RD Converter (siemens_to_ismrmrd v1.0.1, ismrmrd v1.3.2)",
    "license": "Other",
    "maintainer": "Jennifer Reiter <jenniferreiter@invenshure.com>",
    "name": "siemens-to-ismrmrd",
    "source": "https://github.com/ismrmrd/siemens_to_ismrmrd",
    "url": "https://github.com/flywheel-apps/siemens_to_ismrmrd",
    "version": "0.1"
  },
  "invocation-schema": {
    "$schema": "http://json-schema.org/draft-04/schema#",
    "properties": {
      "config": {
        "additionalProperties": false,
        "properties": {
          "debug": {
            "default": false,
            "type": "boolean"
          },
          "measNum": {
            "default": 1,
            "type": "integer"
          }
        },
        "required": [
          "debug",
          "measNum"
        ],
        "type": "object"
      },
      "inputs": {
        "properties": {
          "dat": {
            "properties": {
              "type": {
                "enum": [
                  "Siemens MR Raw"
                ]
              }
            },
            "type": "object"
          },
          "user_map": {
            "properties": {
              "name": {
                "pattern": "^.*.xml$"
              }
            },
            "type": "object"
          },
          "user_stylesheet": {
            "properties": {
              "name": {
                "pattern": "^.*.xsl$"
              }
            },
            "type": "object"
          }
        },
        "required": [
          "dat"
        ],
        "type": "object"
      }
    },
    "required": [
      "config",
      "inputs"
    ],
    "title": "Invocation manifest for Siemens to ISMRM-RD Converter (siemens_to_ismrmrd v1.0.1, ismrmrd v1.3.2)",
    "type": "object"
  }
}
