{
  "exchange": {
    "git-commit": "f3211bb369cdd9df2bf5efd16b989a0bdb0002fc",
    "rootfs-hash": "sha256:916c18fc30f84f8fe45bed10a0a1bded51f627c9689b6dcc005e50c4885acabb",
    "rootfs-url": "docker://us-docker.pkg.dev/flywheel-exchange/gear-exchange/flywheel-ct-total-segmentator:0.1.11_2.0.5"
  },
  "gear": {
    "author": "Flywheel",
    "cite": "Jakob Wasserthal, Manfred Meyer, Hanns-Christian Breit, Joshy Cyriac, Shan Yang, Martin Segeroth, TotalSegmentator: robust segmentation of 104 anatomical structures in CT images",
    "command": "/usr/bin/python run.py",
    "config": {
      "compute-statistics": {
        "default": false,
        "description": "Use --statistics flag. It will calculate volume (in mm3) and mean intensity. Results will be in statistics.json",
        "type": "boolean"
      },
      "debug": {
        "default": false,
        "description": "Enable debug mode.",
        "type": "boolean"
      },
      "use-fast": {
        "default": false,
        "description": "Use --fast flag. it will run a lower resolution model 3mm instead of 1.5mm.",
        "type": "boolean"
      },
      "use-multilabel": {
        "default": true,
        "description": "Use --ml flag. it will Save one multilabel image for all classes.",
        "type": "boolean"
      }
    },
    "custom": {
      "flywheel": {
        "classification": {
          "function": [
            "Image Processing - Segmentation"
          ],
          "modality": [
            "CT"
          ],
          "organ": [
            "Any"
          ],
          "species": [
            "Human"
          ],
          "therapeutic_area": [
            "Multiple"
          ]
        },
        "suite": "Image Processing"
      },
      "gear-builder": {
        "category": "analysis",
        "image": "flywheel/ct-total-segmentator:0.1.11_2.0.5"
      }
    },
    "description": "Tool for segmentation of 104 classes in CT images. It was trained on a wide range of different CT images (different scanners, institutions, protocols,...) and therefore should work well on most images.",
    "environment": {
      "FLYWHEEL": "/flywheel/v0",
      "NVIDIA_DRIVER_CAPABILITIES": "compute,utility",
      "NVIDIA_REQUIRE_CUDA": "cuda>=11.2 brand=tesla,driver>=418,driver<419 brand=tesla,driver>=440,driver<441 driver>=450",
      "NVIDIA_VISIBLE_DEVICES": "all",
      "PATH": "/usr/local/nvidia/bin:/usr/local/cuda/bin:/usr/local/sbin:/usr/local/bin:/usr/sbin:/usr/bin:/sbin:/bin:/opt/conda/bin"
    },
    "inputs": {
      "CT": {
        "base": "file",
        "description": "Input CT volume as a zipped nifti file",
        "optional": false,
        "type": {
          "enum": [
            "nifti"
          ]
        }
      }
    },
    "label": "CT Total Segmentator",
    "license": "Other",
    "maintainer": "Flywheel <support@flywheel.io>",
    "name": "ct-total-segmentator",
    "source": "https://github.com/wasserth/TotalSegmentator",
    "url": "https://gitlab.com/flywheel-io/scientific-solutions/gears/ct-total-segmentator",
    "version": "0.1.11_2.0.5"
  },
  "invocation-schema": {
    "$schema": "http://json-schema.org/draft-04/schema#",
    "properties": {
      "config": {
        "additionalProperties": false,
        "properties": {
          "compute-statistics": {
            "default": false,
            "type": "boolean"
          },
          "debug": {
            "default": false,
            "type": "boolean"
          },
          "use-fast": {
            "default": false,
            "type": "boolean"
          },
          "use-multilabel": {
            "default": true,
            "type": "boolean"
          }
        },
        "required": [
          "compute-statistics",
          "debug",
          "use-fast",
          "use-multilabel"
        ],
        "type": "object"
      },
      "inputs": {
        "properties": {
          "CT": {
            "properties": {
              "type": {
                "enum": [
                  "nifti"
                ]
              }
            },
            "type": "object"
          }
        },
        "required": [
          "CT"
        ],
        "type": "object"
      }
    },
    "required": [
      "config",
      "inputs"
    ],
    "title": "Invocation manifest for CT Total Segmentator",
    "type": "object"
  }
}
