{
  "author": "Flywheel Exchange, Inc",
  "cite": "[1] Isensee, F., Jaeger, P.F., Kohl, S.A.A. et al. (2020). nnU-Net: a self-configuring method for deep learning-based biomedical image segmentation. Nat Methods. https://doi.org/10.1038/s41592-020-01008-z. [2] Isensee, F., Jäger, P. F., Kohl, S. A. A., Petersen, J., & Maier-Hein, K. H. (2021). pretrained models for 3D semantic image segmentation with nnU-Net (2.1). Zenodo. https://doi.org/10.5281/zenodo.4485926. [3] Simpson, A. L., Antonelli, M., Bakas, S., Bilello, M., Farahani, K., Van Ginneken, B., ... & Cardoso, M. J. (2019). A large annotated medical image dataset for the development and evaluation of segmentation algorithms. arXiv preprint arXiv:1902.09063.",
  "command": "python run.py",
  "config": {
    "debug": {
      "default": false,
      "description": "Whether to include debug statements in the job logs",
      "type": "boolean"
    },
    "pretrained_model": {
      "description": "Pre-trained model to use for inference",
      "enum": [
        "Task001_BrainTumour",
        "Task002_Heart",
        "Task003_Liver",
        "Task004_Hippocampus",
        "Task005_Prostate",
        "Task006_Lung",
        "Task007_Pancreas",
        "Task008_HepaticVessel",
        "Task009_Spleen",
        "Task010_Colon"
      ],
      "type": "string"
    }
  },
  "custom": {
    "flywheel": {
      "classification": {
        "function": [
          "Analysis"
        ]
      },
      "show-job": true,
      "suite": "Analysis"
    },
    "gear-builder": {
      "category": "analysis",
      "image": "flywheel/nnunetv1:0.1.2"
    }
  },
  "description": "Run inference by the nnUnet v1 model.",
  "environment": {
    "FLYWHEEL": "/flywheel/v0",
    "GPG_KEY": "A035C8C19219BA821ECEA86B64E628F8D684696D",
    "INPUT_FOLDER": "/flywheel/v0/input",
    "LANG": "C.UTF-8",
    "MODEL": "Task004_Hippocampus",
    "MODELS_FOLDER": "/flywheel/v0/models",
    "OUTPUT_FOLDER": "/flywheel/v0/output",
    "PATH": "/usr/local/bin:/usr/local/sbin:/usr/local/bin:/usr/sbin:/usr/bin:/sbin:/bin",
    "PWD": "/flywheel/v0",
    "PYTHON_GET_PIP_SHA256": "bc37786ec99618416cc0a0ca32833da447f4d91ab51d2c138dd15b7af21e8e9a",
    "PYTHON_GET_PIP_URL": "https://github.com/pypa/get-pip/raw/def4aec84b261b939137dd1c69eff0aabb4a7bf4/public/get-pip.py",
    "PYTHON_PIP_VERSION": "24.0",
    "PYTHON_SETUPTOOLS_VERSION": "65.5.1",
    "PYTHON_VERSION": "3.11.10",
    "RESULTS_FOLDER": "/flywheel/v0/models/installs"
  },
  "inputs": {
    "api-key": {
      "base": "api-key",
      "read-only": true
    },
    "modality_0": {
      "base": "file",
      "description": "3D or 4D NIfTI file. If 4D, should be only modality input.",
      "optional": false
    },
    "modality_1": {
      "base": "file",
      "description": "3D NIfTI file.",
      "optional": true
    },
    "modality_2": {
      "base": "file",
      "description": "3D NIfTI file.",
      "optional": true
    },
    "modality_3": {
      "base": "file",
      "description": "3D NIfTI file.",
      "optional": true
    }
  },
  "label": "nnunetv1",
  "license": "Other",
  "maintainer": "Flywheel support@flywheel.io",
  "name": "nnunetv1",
  "source": "https://github.com/MIC-DKFZ/nnUNet/tree/nnunetv1",
  "url": "https://gitlab.com/flywheel-io/scientific-solutions/gears/nnunetv1",
  "version": "0.1.2"
}
