{
  "exchange": {
    "git-commit": "fe2d2100eaaf98bcfe800f916776b8abdea96c7b",
    "rootfs-hash": "sha256:23dce7fbd1f04992121ec333bc5c70ac83ece8fc62701a3aa686ed15fd474346",
    "rootfs-url": "docker://us-docker.pkg.dev/flywheel-exchange/gear-exchange/flywheel-cow-says:2.3.4"
  },
  "gear": {
    "author": "Flywheel",
    "cite": "",
    "command": "python run.py",
    "config": {
      "animal": {
        "default": "cow",
        "enum": [
          "beavis",
          "char_names",
          "chars",
          "cheese",
          "cow",
          "daemon",
          "dragon",
          "ghostbusters",
          "kitty",
          "main",
          "meow",
          "milk",
          "pig",
          "stegosaurus",
          "stimpy",
          "turkey",
          "turtle",
          "tux"
        ],
        "type": "string"
      },
      "debug": {
        "default": false,
        "description": "Log debug messages",
        "type": "boolean"
      }
    },
    "custom": {
      "flywheel": {
        "classification": {
          "function": [
            "Other"
          ],
          "modality": [
            "Other"
          ],
          "organ": [
            "Other"
          ],
          "species": [
            "Animal"
          ],
          "therapeutic_area": [
            "Other"
          ]
        },
        "show-job": true,
        "suite": "Other"
      },
      "gear-builder": {
        "category": "utility",
        "image": "flywheel/poetry-cow-says:2.3.4"
      }
    },
    "description": "The CowSays gear is an demo utility gear that makes animals speak. It uses as an example to illustrate how our skeleton gear template (available at https://gitlab.com/flywheel-io/scientific-solutions/gears/templates/skeleton) can be used.",
    "environment": {},
    "inputs": {
      "text-input": {
        "base": "file",
        "description": "Text file for the animal."
      }
    },
    "label": "Cow-says gear",
    "license": "MIT",
    "maintainer": "Flywheel <support@flywheel.io>",
    "name": "cow-says",
    "source": "https://gitlab.com/flywheel-io/scientific-solutions/gears/templates/poetry-cow-says",
    "url": "https://gitlab.com/flywheel-io/scientific-solutions/gears/templates/poetry-cow-says",
    "version": "2.3.4"
  },
  "invocation-schema": {
    "$schema": "http://json-schema.org/draft-04/schema#",
    "properties": {
      "config": {
        "additionalProperties": false,
        "properties": {
          "animal": {
            "default": "cow",
            "enum": [
              "beavis",
              "char_names",
              "chars",
              "cheese",
              "cow",
              "daemon",
              "dragon",
              "ghostbusters",
              "kitty",
              "main",
              "meow",
              "milk",
              "pig",
              "stegosaurus",
              "stimpy",
              "turkey",
              "turtle",
              "tux"
            ],
            "type": "string"
          },
          "debug": {
            "default": false,
            "type": "boolean"
          }
        },
        "required": [
          "animal",
          "debug"
        ],
        "type": "object"
      },
      "inputs": {
        "properties": {
          "text-input": {
            "properties": {},
            "type": "object"
          }
        },
        "required": [
          "text-input"
        ],
        "type": "object"
      }
    },
    "required": [
      "config",
      "inputs"
    ],
    "title": "Invocation manifest for Cow-says gear",
    "type": "object"
  }
}
