{
  "exchange": {
    "git-commit": "c1e23846f521aaf7f40701376815f30183806a97",
    "rootfs-hash": "sha256:9c2c8e0d7e821416674f941a2a39fb5e263a2aa7811e03cd41182e8553513e7e",
    "rootfs-url": "docker://us-docker.pkg.dev/flywheel-exchange/gear-exchange/scitran-nifti-montage:1.4.0"
  },
  "gear": {
    "author": "SciTran Team",
    "config": {
      "montage_type": {
        "default": "zip",
        "description": "str [default 'zip'] Type of montage to create. can be 'zip', or 'png'.",
        "type": "string"
      },
      "tile_size": {
        "default": 256,
        "description": "int [default 256] Tile size for generated zip or directory pyramid (has no affect when montage_type='png').",
        "type": "integer"
      },
      "voxel_order": {
        "default": "LPS",
        "description": "str [default 'LPS'] Three character string indicating the voxel order.",
        "type": "string"
      }
    },
    "custom": {
      "docker-image": "scitran/nifti-montage:1.4.0",
      "flywheel": {
        "classification": {
          "function": [
            "Report",
            "Quality Assurance"
          ],
          "modality": [
            "Any"
          ],
          "organ": [
            "Any"
          ],
          "species": [
            "Phantom",
            "Human",
            "Animal",
            "Other"
          ],
          "therapeutic_area": [
            "Any"
          ]
        },
        "suite": "Report"
      },
      "gear-builder": {
        "category": "utility"
      }
    },
    "description": "Creates a montage (zip, or png) from a NIfTI file.",
    "flywheel": "0",
    "inputs": {
      "nifti": {
        "base": "file",
        "description": "NIfTI file",
        "type": {
          "enum": [
            "nifti"
          ]
        }
      }
    },
    "label": "SciTran: NIfTI Montage Creation Tool",
    "license": "Apache-2.0",
    "maintainer": "Michael Perry <lmperry@stanford.edu>",
    "name": "scitran-nifti-montage",
    "source": "https://github.com/scitran-apps/nifti-montage",
    "url": "https://github.com/scitran-apps/nifti-montage",
    "version": "1.4.0"
  },
  "invocation-schema": {
    "$schema": "http://json-schema.org/draft-04/schema#",
    "properties": {
      "config": {
        "additionalProperties": false,
        "properties": {
          "montage_type": {
            "default": "zip",
            "type": "string"
          },
          "tile_size": {
            "default": 256,
            "type": "integer"
          },
          "voxel_order": {
            "default": "LPS",
            "type": "string"
          }
        },
        "required": [
          "voxel_order",
          "tile_size",
          "montage_type"
        ],
        "type": "object"
      },
      "inputs": {
        "properties": {
          "nifti": {
            "properties": {
              "type": {
                "enum": [
                  "nifti"
                ]
              }
            },
            "type": "object"
          }
        },
        "required": [
          "nifti"
        ],
        "type": "object"
      }
    },
    "required": [
      "config",
      "inputs"
    ],
    "title": "Invocation manifest for SciTran: NIfTI Montage Creation Tool",
    "type": "object"
  }
}
