{
  "exchange": {
    "git-commit": "22f8a3dabb7f8b105ec9067ed99707a0b892a0b6",
    "rootfs-hash": "sha256:45c2a5397c6bd8c87001aa1dd6b1319bd5e670c012ba1d53bf912d1d650c8495",
    "rootfs-url": "docker://us-docker.pkg.dev/flywheel-exchange/gear-exchange/flywheel-petsurfer-mc:0.1.4_7.3.2"
  },
  "gear": {
    "author": "Flywheel, Inc",
    "cite": "https://surfer.nmr.mgh.harvard.edu/fswiki/PetSurfer",
    "command": "python run.py",
    "config": {
      "debug": {
        "default": false,
        "description": "Log debug messages",
        "type": "boolean"
      },
      "frame_pattern": {
        "description": "Text regular expression that will be used to get the frames to be aligned. For example if the pattern will be '^(ID01|Frame)$', the gear will look for ID01 and Frame to get the PET volumes for the template creation. It is case Insensitive.",
        "optional": false,
        "type": "string"
      },
      "freesurfer_license_key": {
        "description": "Text from license file generated during FreeSurfer registration. *Entries should be space separated.*",
        "optional": true,
        "type": "string"
      },
      "ref_frame": {
        "default": "0",
        "description": "If the PET data only have one frame (eg, an uptake image), then that will be the template. If the PET data has multiple frames (ie, dynamic), then the template will be created from the dynamic data. In this case, this option can be used to specify which frame will be used as reference.",
        "type": "string"
      },
      "template_creation": {
        "default": "mean",
        "description": "Select a method for PET template creation that will be used as target image for motion correction of PET dynamic volumes. The template can be generated by extracting a single frame ('sinlge_frame') or averaging all the time frames together ('mean').",
        "enum": [
          "single_frame",
          "mean"
        ],
        "type": "string"
      }
    },
    "custom": {
      "flywheel": {
        "classification": {
          "function": [
            "Image Processing - Structural"
          ],
          "modality": [
            "PT"
          ],
          "organ": [
            "Brain"
          ],
          "species": [
            "Human"
          ],
          "therapeutic_area": [
            "Neurology",
            "Oncology",
            "Psychiatry/Psychology"
          ]
        },
        "show-job": true,
        "suite": "Image Processing"
      },
      "gear-builder": {
        "category": "analysis",
        "image": "flywheel/petsurfer-mc:0.1.4_7.3.2"
      }
    },
    "description": "Motion correction of PET volumes (Petsurfer pipeline).",
    "environment": {
      "DEBCONF_NOWARNINGS": "yes",
      "DEBIAN_FRONTEND": "noninteractive",
      "FLYWHEEL": "/flywheel/v0",
      "FMRI_ANALYSIS_DIR": "/opt/freesurfer/fsfast",
      "FREESURFER_HOME": "/opt/freesurfer",
      "FSFAST_HOME": "/opt/freesurfer/fsfast",
      "FSF_OUTPUT_FORMAT": "nii.gz",
      "FS_LICENSE": "/opt/freesurfer/license.txt",
      "FS_OVERRIDE": "0",
      "GPG_KEY": "A035C8C19219BA821ECEA86B64E628F8D684696D",
      "LANG": "C.UTF-8",
      "LOCAL_DIR": "/opt/freesurfer/local",
      "MINC_BIN_DIR": "/opt/freesurfer/mni/bin",
      "MINC_LIB_DIR": "/opt/freesurfer/mni/lib",
      "MNI_DATAPATH": "/opt/freesurfer/mni/data",
      "MNI_DIR": "/opt/freesurfer/mni",
      "MNI_PERL5LIB": "/opt/freesurfer/mni/share/perl5/",
      "OS": "Linux",
      "PATH": "/opt/miniconda-latest/bin:/opt/freesurfer/bin:/opt/freesurfer/fsfast/bin:/opt/freesurfer/tktools:/opt/freesurfer/mni/bin:/usr/lib/fsl/5.0:/usr/local/sbin:/usr/local/bin:/usr/sbin:/usr/bin:/sbin:/bin",
      "PERL5LIB": "/opt/freesurfer/mni/share/perl5",
      "PYTHON_GET_PIP_SHA256": "45a2bb8bf2bb5eff16fdd00faef6f29731831c7c59bd9fc2bf1f3bed511ff1fe",
      "PYTHON_GET_PIP_URL": "https://github.com/pypa/get-pip/raw/9af82b715db434abb94a0a6f3569f43e72157346/public/get-pip.py",
      "PYTHON_PIP_VERSION": "23.0.1",
      "PYTHON_SETUPTOOLS_VERSION": "65.5.1",
      "PYTHON_VERSION": "3.10.13",
      "SUBJECTS_DIR": "/opt/freesurfer/subjects"
    },
    "inputs": {
      "api-key": {
        "base": "api-key",
        "read-only": false
      },
      "freesurfer_license_file": {
        "base": "file",
        "description": "FreeSurfer license file, provided during registration with FreeSurfer. This file will be copied to the $FSHOME directory and used during execution of the Gear.",
        "optional": true
      },
      "input-file": {
        "base": "file",
        "description": "Input NIfTI file for the Motion correction",
        "optional": false,
        "type": {
          "enum": [
            "nifti"
          ]
        }
      }
    },
    "label": "Petsurfer motion correction",
    "license": "Other",
    "maintainer": "Flywheel <support@flywheel.io>",
    "name": "petsurfer-mc",
    "source": "https://gitlab.com/flywheel-io/scientific-solutions/gears/petsurfer-mc",
    "url": "https://gitlab.com/flywheel-io/scientific-solutions/gears/petsurfer-mc",
    "version": "0.1.4_7.3.2"
  },
  "invocation-schema": {
    "$schema": "http://json-schema.org/draft-04/schema#",
    "properties": {
      "config": {
        "additionalProperties": false,
        "properties": {
          "debug": {
            "default": false,
            "type": "boolean"
          },
          "frame_pattern": {
            "type": "string"
          },
          "freesurfer_license_key": {
            "type": "string"
          },
          "ref_frame": {
            "default": "0",
            "type": "string"
          },
          "template_creation": {
            "default": "mean",
            "enum": [
              "single_frame",
              "mean"
            ],
            "type": "string"
          }
        },
        "required": [
          "debug",
          "frame_pattern",
          "template_creation",
          "ref_frame"
        ],
        "type": "object"
      },
      "inputs": {
        "properties": {
          "api-key": {
            "type": "object"
          },
          "freesurfer_license_file": {
            "properties": {},
            "type": "object"
          },
          "input-file": {
            "properties": {
              "type": {
                "enum": [
                  "nifti"
                ]
              }
            },
            "type": "object"
          }
        },
        "required": [
          "api-key",
          "input-file"
        ],
        "type": "object"
      }
    },
    "required": [
      "config",
      "inputs"
    ],
    "title": "Invocation manifest for Petsurfer motion correction",
    "type": "object"
  }
}
