<svg
  xmlns="http://www.w3.org/2000/svg"
  viewBox="0 0 18 18"
  aria-labelledby="title"
  width="1em"
  height="1em"
  fill="currentColor"
>
  <g id="icon-freehand-menu" fill="none" stroke-width="1.5" stroke-linecap="round" stroke-linejoin="round">
    <line id="svg_4" y2="9.12785" x2="2.045199" y1="2.602749" x1="5.482813"/>
    <line id="svg_5" y2="16.607843" x2="6.565024" y1="9.509807" x1="2.204347"/>
    <line id="svg_6" y2="16.003078" x2="14.267826" y1="16.576014" x1="6.692343"/>
    <line id="svg_7" y2="10.942146" x2="15.572846" y1="15.939418" x1="14.331486"/>
    <line id="svg_8" y2="2.825558" x2="13.058295" y1="2.889217" x1="5.641961"/>
    <line id="svg_9" y2="7.568192" x2="15.795655" y1="3.398493" x1="12.930976"/>
    <line id="svg_10" y2="11.037635" x2="15.509187" y1="7.727341" x1="15.700165"/>
  </g>
</svg>
