<svg width="18" height="18" viewBox="0 0 22 22" fill="none" xmlns="http://www.w3.org/2000/svg">
<g id="Design, Tools/pencil edit create">
<path id="Vector" d="M6.41665 19.9375H6.27915C3.44665 19.9375 1.14581 17.6367 1.14581 14.8042C1.14581 12.7783 2.34665 10.9358 4.19831 10.1108L7.82831 8.49749C8.78165 8.07582 9.39581 7.12249 9.39581 6.07749C9.39581 4.61999 8.20415 3.42832 6.74665 3.42832H6.41665C6.04081 3.42832 5.72915 3.11666 5.72915 2.74082C5.72915 2.36499 6.04081 2.05332 6.41665 2.05332H6.74665C8.96498 2.05332 10.7708 3.85916 10.7708 6.07749C10.7708 7.66332 9.83581 9.10249 8.37831 9.75332L4.74831 11.3667C3.39165 11.9717 2.52081 13.3192 2.52081 14.8042C2.52081 16.8758 4.20748 18.5625 6.27915 18.5625H6.41665C6.79248 18.5625 7.10415 18.8742 7.10415 19.25C7.10415 19.6258 6.79248 19.9375 6.41665 19.9375ZM9.49665 19.8183C9.15748 19.8183 8.82748 19.6808 8.57998 19.4425C8.25915 19.1217 8.13081 18.6633 8.23165 18.2233L8.58915 16.7108C8.69915 16.2525 8.92831 15.84 9.25831 15.5008L15.5283 9.23082C15.5283 9.23082 15.565 9.18499 15.5833 9.16666C15.6016 9.14832 15.6291 9.12999 15.6475 9.11166L17.0408 7.71832C17.6458 7.11332 18.7 7.11332 19.305 7.71832L20.295 8.70832C20.5975 9.01082 20.7625 9.41416 20.7625 9.84499C20.7625 10.2758 20.5975 10.6792 20.295 10.9817L18.9016 12.375C18.9016 12.375 18.865 12.4208 18.8466 12.4392C18.8283 12.4575 18.8008 12.4758 18.7825 12.4942L12.5125 18.7642C12.1825 19.0942 11.77 19.3233 11.3116 19.4333L9.79915 19.7908C9.69831 19.8183 9.59748 19.8275 9.49665 19.8275V19.8183ZM10.23 16.4633C10.0741 16.6192 9.97331 16.8117 9.92748 17.0133L9.59748 18.4067L10.9908 18.0767C11.2016 18.0308 11.385 17.9208 11.5408 17.7742L17.3891 11.935L16.0783 10.6242L10.2391 16.4633H10.23ZM17.0408 9.65249L18.3516 10.9633L19.3233 9.99166C19.3783 9.93666 19.3875 9.86332 19.3875 9.82666C19.3875 9.78999 19.3875 9.72582 19.3233 9.66166L18.3333 8.67166C18.2141 8.55249 18.1316 8.55249 18.0125 8.67166L17.0408 9.64332V9.65249Z" fill="#84A2C0"/>
</g>
</svg>
