{"status":"The push refers to repository [ga.ce.flywheel.io/splitter]"}
{"status":"Preparing","progressDetail":{},"id":"df11e617ad52"}
{"status":"Preparing","progressDetail":{},"id":"696dc38bf982"}
{"status":"Preparing","progressDetail":{},"id":"b927959802d1"}
{"status":"Preparing","progressDetail":{},"id":"f7aa7fddc751"}
{"status":"Preparing","progressDetail":{},"id":"cddd3e676272"}
{"status":"Preparing","progressDetail":{},"id":"a016c5cccb3f"}
{"status":"Preparing","progressDetail":{},"id":"0156efebb8c3"}
{"status":"Preparing","progressDetail":{},"id":"8ab46b5dc98d"}
{"status":"Preparing","progressDetail":{},"id":"3ce6c827e0fe"}
{"status":"Preparing","progressDetail":{},"id":"3102aefb25e8"}
{"status":"Preparing","progressDetail":{},"id":"1591bf7ec708"}
{"status":"Preparing","progressDetail":{},"id":"dd3097cd7909"}
{"status":"Preparing","progressDetail":{},"id":"685934357c89"}
{"status":"Preparing","progressDetail":{},"id":"ccb9b68523fd"}
{"status":"Preparing","progressDetail":{},"id":"00bcea93703b"}
{"status":"Preparing","progressDetail":{},"id":"688e187d6c79"}
{"status":"Waiting","progressDetail":{},"id":"00bcea93703b"}
{"status":"Waiting","progressDetail":{},"id":"688e187d6c79"}
{"status":"Waiting","progressDetail":{},"id":"a016c5cccb3f"}
{"status":"Waiting","progressDetail":{},"id":"3ce6c827e0fe"}
{"status":"Waiting","progressDetail":{},"id":"0156efebb8c3"}
{"status":"Waiting","progressDetail":{},"id":"8ab46b5dc98d"}
{"status":"Waiting","progressDetail":{},"id":"ccb9b68523fd"}
{"status":"Waiting","progressDetail":{},"id":"1591bf7ec708"}
{"status":"Waiting","progressDetail":{},"id":"dd3097cd7909"}
{"status":"Waiting","progressDetail":{},"id":"685934357c89"}
{"status":"Pushing","progressDetail":{"current":1024,"total":82601},"progress":"[>                                                  ]  1.024kB/82.6kB","id":"696dc38bf982"}
{"status":"Pushing","progressDetail":{"current":100864,"total":82601},"progress":"[==================================================>]  100.9kB","id":"696dc38bf982"}
{"status":"Pushing","progressDetail":{"current":512,"total":4253},"progress":"[======>                                            ]     512B/4.253kB","id":"b927959802d1"}
{"status":"Pushing","progressDetail":{"current":1024,"total":101035},"progress":"[>                                                  ]  1.024kB/101kB","id":"cddd3e676272"}
{"status":"Pushing","progressDetail":{"current":8192,"total":4253},"progress":"[==================================================>]  8.192kB","id":"b927959802d1"}
{"status":"Pushing","progressDetail":{"current":104960,"total":101035},"progress":"[==================================================>]    105kB","id":"cddd3e676272"}
{"status":"Pushing","progressDetail":{"current":496128,"total":47366212},"progress":"[>                                                  ]  496.1kB/47.37MB","id":"df11e617ad52"}
{"status":"Pushing","progressDetail":{"current":528958,"total":464501131},"progress":"[>                                                  ]    529kB/464.5MB","id":"f7aa7fddc751"}
{"status":"Pushing","progressDetail":{"current":2462208,"total":47366212},"progress":"[==>                                                ]  2.462MB/47.37MB","id":"df11e617ad52"}
{"status":"Pushing","progressDetail":{"current":1616384,"total":464501131},"progress":"[>                                                  ]  1.616MB/464.5MB","id":"f7aa7fddc751"}
{"status":"Pushing","progressDetail":{"current":5411328,"total":47366212},"progress":"[=====>                                             ]  5.411MB/47.37MB","id":"df11e617ad52"}
{"status":"Pushing","progressDetail":{"current":3287552,"total":464501131},"progress":"[>                                                  ]  3.288MB/464.5MB","id":"f7aa7fddc751"}
{"status":"Pushing","progressDetail":{"current":9842688,"total":47366212},"progress":"[==========>                                        ]  9.843MB/47.37MB","id":"df11e617ad52"}
{"status":"Pushing","progressDetail":{"current":7148032,"total":464501131},"progress":"[>                                                  ]  7.148MB/464.5MB","id":"f7aa7fddc751"}
{"status":"Pushing","progressDetail":{"current":14248960,"total":47366212},"progress":"[===============>                                   ]  14.25MB/47.37MB","id":"df11e617ad52"}
{"status":"Pushing","progressDetail":{"current":11023872,"total":464501131},"progress":"[=>                                                 ]  11.02MB/464.5MB","id":"f7aa7fddc751"}
{"status":"Pushing","progressDetail":{"current":17680896,"total":47366212},"progress":"[==================>                                ]  17.68MB/47.37MB","id":"df11e617ad52"}
{"status":"Pushing","progressDetail":{"current":14923264,"total":464501131},"progress":"[=>                                                 ]  14.92MB/464.5MB","id":"f7aa7fddc751"}
{"status":"Pushing","progressDetail":{"current":18822656,"total":464501131},"progress":"[==>                                                ]  18.82MB/464.5MB","id":"f7aa7fddc751"}
{"status":"Pushing","progressDetail":{"current":20641280,"total":47366212},"progress":"[=====================>                             ]  20.64MB/47.37MB","id":"df11e617ad52"}
{"status":"Pushing","progressDetail":{"current":22722048,"total":464501131},"progress":"[==>                                                ]  22.72MB/464.5MB","id":"f7aa7fddc751"}
{"status":"Pushing","progressDetail":{"current":23577600,"total":47366212},"progress":"[========================>                          ]  23.58MB/47.37MB","id":"df11e617ad52"}
{"status":"Pushing","progressDetail":{"current":26616320,"total":464501131},"progress":"[==>                                                ]  26.62MB/464.5MB","id":"f7aa7fddc751"}
{"status":"Pushing","progressDetail":{"current":26502144,"total":47366212},"progress":"[===========================>                       ]   26.5MB/47.37MB","id":"df11e617ad52"}
{"status":"Pushing","progressDetail":{"current":29958656,"total":464501131},"progress":"[===>                                               ]  29.96MB/464.5MB","id":"f7aa7fddc751"}
{"status":"Pushing","progressDetail":{"current":29438976,"total":47366212},"progress":"[===============================>                   ]  29.44MB/47.37MB","id":"df11e617ad52"}
{"status":"Pushing","progressDetail":{"current":33858048,"total":464501131},"progress":"[===>                                               ]  33.86MB/464.5MB","id":"f7aa7fddc751"}
{"status":"Pushing","progressDetail":{"current":32390656,"total":47366212},"progress":"[==================================>                ]  32.39MB/47.37MB","id":"df11e617ad52"}
{"status":"Pushed","progressDetail":{},"id":"696dc38bf982"}
{"status":"Pushing","progressDetail":{"current":37757440,"total":464501131},"progress":"[====>                                              ]  37.76MB/464.5MB","id":"f7aa7fddc751"}
{"status":"Pushing","progressDetail":{"current":34848256,"total":47366212},"progress":"[====================================>              ]  34.85MB/47.37MB","id":"df11e617ad52"}
{"status":"Pushed","progressDetail":{},"id":"cddd3e676272"}
{"status":"Pushing","progressDetail":{"current":41656832,"total":464501131},"progress":"[====>                                              ]  41.66MB/464.5MB","id":"f7aa7fddc751"}
{"status":"Pushed","progressDetail":{},"id":"b927959802d1"}
{"status":"Pushing","progressDetail":{"current":2048},"progress":" 2.048kB","id":"a016c5cccb3f"}
{"status":"Pushing","progressDetail":{"current":37799936,"total":47366212},"progress":"[=======================================>           ]   37.8MB/47.37MB","id":"df11e617ad52"}
{"status":"Pushing","progressDetail":{"current":43328000,"total":464501131},"progress":"[====>                                              ]  43.33MB/464.5MB","id":"f7aa7fddc751"}
{"status":"Layer already exists","progressDetail":{},"id":"8ab46b5dc98d"}
{"status":"Pushing","progressDetail":{"current":40751616,"total":47366212},"progress":"[===========================================>       ]  40.75MB/47.37MB","id":"df11e617ad52"}
{"status":"Pushing","progressDetail":{"current":528666,"total":231121686},"progress":"[>                                                  ]  528.7kB/231.1MB","id":"0156efebb8c3"}
{"status":"Pushing","progressDetail":{"current":47227392,"total":464501131},"progress":"[=====>                                             ]  47.23MB/464.5MB","id":"f7aa7fddc751"}
{"status":"Pushing","progressDetail":{"current":43670528,"total":47366212},"progress":"[==============================================>    ]  43.67MB/47.37MB","id":"df11e617ad52"}
{"status":"Pushing","progressDetail":{"current":4327760,"total":231121686},"progress":"[>                                                  ]  4.328MB/231.1MB","id":"0156efebb8c3"}
{"status":"Pushing","progressDetail":{"current":50569728,"total":464501131},"progress":"[=====>                                             ]  50.57MB/464.5MB","id":"f7aa7fddc751"}
{"status":"Layer already exists","progressDetail":{},"id":"3ce6c827e0fe"}
{"status":"Pushing","progressDetail":{"current":45652992,"total":47366212},"progress":"[================================================>  ]  45.65MB/47.37MB","id":"df11e617ad52"}
{"status":"Pushing","progressDetail":{"current":8169984,"total":231121686},"progress":"[=>                                                 ]   8.17MB/231.1MB","id":"0156efebb8c3"}
{"status":"Pushing","progressDetail":{"current":47407616,"total":47366212},"progress":"[==================================================>]  47.41MB","id":"df11e617ad52"}
{"status":"Pushing","progressDetail":{"current":54441472,"total":464501131},"progress":"[=====>                                             ]  54.44MB/464.5MB","id":"f7aa7fddc751"}
{"status":"Layer already exists","progressDetail":{},"id":"3102aefb25e8"}
{"status":"Pushing","progressDetail":{"current":11412399,"total":231121686},"progress":"[==>                                                ]  11.41MB/231.1MB","id":"0156efebb8c3"}
{"status":"Pushing","progressDetail":{"current":58272768,"total":464501131},"progress":"[======>                                            ]  58.27MB/464.5MB","id":"f7aa7fddc751"}
{"status":"Pushing","progressDetail":{"current":15750656,"total":231121686},"progress":"[===>                                               ]  15.75MB/231.1MB","id":"0156efebb8c3"}
{"status":"Layer already exists","progressDetail":{},"id":"1591bf7ec708"}
{"status":"Pushing","progressDetail":{"current":62172160,"total":464501131},"progress":"[======>                                            ]  62.17MB/464.5MB","id":"f7aa7fddc751"}
{"status":"Pushing","progressDetail":{"current":19591168,"total":231121686},"progress":"[====>                                              ]  19.59MB/231.1MB","id":"0156efebb8c3"}
{"status":"Layer already exists","progressDetail":{},"id":"dd3097cd7909"}
{"status":"Pushing","progressDetail":{"current":22814720,"total":231121686},"progress":"[====>                                              ]  22.81MB/231.1MB","id":"0156efebb8c3"}
{"status":"Pushing","progressDetail":{"current":64400384,"total":464501131},"progress":"[======>                                            ]   64.4MB/464.5MB","id":"f7aa7fddc751"}
{"status":"Pushing","progressDetail":{"current":27097600,"total":231121686},"progress":"[=====>                                             ]   27.1MB/231.1MB","id":"0156efebb8c3"}
{"status":"Layer already exists","progressDetail":{},"id":"685934357c89"}
{"status":"Pushing","progressDetail":{"current":68299776,"total":464501131},"progress":"[=======>                                           ]   68.3MB/464.5MB","id":"f7aa7fddc751"}
{"status":"Pushing","progressDetail":{"current":31419392,"total":231121686},"progress":"[======>                                            ]  31.42MB/231.1MB","id":"0156efebb8c3"}
{"status":"Pushed","progressDetail":{},"id":"a016c5cccb3f"}
{"status":"Pushing","progressDetail":{"current":72154624,"total":464501131},"progress":"[=======>                                           ]  72.15MB/464.5MB","id":"f7aa7fddc751"}
{"status":"Layer already exists","progressDetail":{},"id":"ccb9b68523fd"}
{"status":"Pushing","progressDetail":{"current":35195904,"total":231121686},"progress":"[=======>                                           ]   35.2MB/231.1MB","id":"0156efebb8c3"}
{"status":"Pushing","progressDetail":{"current":76054016,"total":464501131},"progress":"[========>                                          ]  76.05MB/464.5MB","id":"f7aa7fddc751"}
{"status":"Pushing","progressDetail":{"current":38959040,"total":231121686},"progress":"[========>                                          ]  38.96MB/231.1MB","id":"0156efebb8c3"}
{"status":"Layer already exists","progressDetail":{},"id":"00bcea93703b"}
{"status":"Layer already exists","progressDetail":{},"id":"688e187d6c79"}
{"status":"Pushing","progressDetail":{"current":79953408,"total":464501131},"progress":"[========>                                          ]  79.95MB/464.5MB","id":"f7aa7fddc751"}
{"status":"Pushing","progressDetail":{"current":42682880,"total":231121686},"progress":"[=========>                                         ]  42.68MB/231.1MB","id":"0156efebb8c3"}
{"status":"Pushing","progressDetail":{"current":83701760,"total":464501131},"progress":"[=========>                                         ]   83.7MB/464.5MB","id":"f7aa7fddc751"}
{"status":"Pushing","progressDetail":{"current":47139328,"total":231121686},"progress":"[==========>                                        ]  47.14MB/231.1MB","id":"0156efebb8c3"}
{"status":"Pushed","progressDetail":{},"id":"df11e617ad52"}
{"status":"Pushing","progressDetail":{"current":87044096,"total":464501131},"progress":"[=========>                                         ]  87.04MB/464.5MB","id":"f7aa7fddc751"}
{"status":"Pushing","progressDetail":{"current":51543040,"total":231121686},"progress":"[===========>                                       ]  51.54MB/231.1MB","id":"0156efebb8c3"}
{"status":"Pushing","progressDetail":{"current":90386432,"total":464501131},"progress":"[=========>                                         ]  90.39MB/464.5MB","id":"f7aa7fddc751"}
{"status":"Pushing","progressDetail":{"current":58187776,"total":231121686},"progress":"[============>                                      ]  58.19MB/231.1MB","id":"0156efebb8c3"}
{"status":"Pushing","progressDetail":{"current":94285824,"total":464501131},"progress":"[==========>                                        ]  94.29MB/464.5MB","id":"f7aa7fddc751"}
{"status":"Pushing","progressDetail":{"current":61530112,"total":231121686},"progress":"[=============>                                     ]  61.53MB/231.1MB","id":"0156efebb8c3"}
{"status":"Pushing","progressDetail":{"current":97054208,"total":464501131},"progress":"[==========>                                        ]  97.05MB/464.5MB","id":"f7aa7fddc751"}
{"status":"Pushing","progressDetail":{"current":65379840,"total":231121686},"progress":"[==============>                                    ]  65.38MB/231.1MB","id":"0156efebb8c3"}
{"status":"Pushing","progressDetail":{"current":100307892,"total":464501131},"progress":"[==========>                                        ]  100.3MB/464.5MB","id":"f7aa7fddc751"}
{"status":"Pushing","progressDetail":{"current":68686512,"total":231121686},"progress":"[==============>                                    ]  68.69MB/231.1MB","id":"0156efebb8c3"}
{"status":"Pushing","progressDetail":{"current":106159104,"total":464501131},"progress":"[===========>                                       ]  106.2MB/464.5MB","id":"f7aa7fddc751"}
{"status":"Pushing","progressDetail":{"current":71457280,"total":231121686},"progress":"[===============>                                   ]  71.46MB/231.1MB","id":"0156efebb8c3"}
{"status":"Pushing","progressDetail":{"current":73685504,"total":231121686},"progress":"[===============>                                   ]  73.69MB/231.1MB","id":"0156efebb8c3"}
{"status":"Pushing","progressDetail":{"current":110948663,"total":464501131},"progress":"[===========>                                       ]  110.9MB/464.5MB","id":"f7aa7fddc751"}
{"status":"Pushing","progressDetail":{"current":113627136,"total":464501131},"progress":"[============>                                      ]  113.6MB/464.5MB","id":"f7aa7fddc751"}
{"status":"Pushing","progressDetail":{"current":76965888,"total":231121686},"progress":"[================>                                  ]  76.97MB/231.1MB","id":"0156efebb8c3"}
{"status":"Pushing","progressDetail":{"current":117335966,"total":464501131},"progress":"[============>                                      ]  117.3MB/464.5MB","id":"f7aa7fddc751"}
{"status":"Pushing","progressDetail":{"current":80788480,"total":231121686},"progress":"[=================>                                 ]  80.79MB/231.1MB","id":"0156efebb8c3"}
{"status":"Pushing","progressDetail":{"current":120577024,"total":464501131},"progress":"[============>                                      ]  120.6MB/464.5MB","id":"f7aa7fddc751"}
{"status":"Pushing","progressDetail":{"current":84687872,"total":231121686},"progress":"[==================>                                ]  84.69MB/231.1MB","id":"0156efebb8c3"}
{"status":"Pushing","progressDetail":{"current":123362304,"total":464501131},"progress":"[=============>                                     ]  123.4MB/464.5MB","id":"f7aa7fddc751"}
{"status":"Pushing","progressDetail":{"current":88587264,"total":231121686},"progress":"[===================>                               ]  88.59MB/231.1MB","id":"0156efebb8c3"}
{"status":"Pushing","progressDetail":{"current":127261696,"total":464501131},"progress":"[=============>                                     ]  127.3MB/464.5MB","id":"f7aa7fddc751"}
{"status":"Pushing","progressDetail":{"current":92486656,"total":231121686},"progress":"[====================>                              ]  92.49MB/231.1MB","id":"0156efebb8c3"}
{"status":"Pushing","progressDetail":{"current":131161088,"total":464501131},"progress":"[==============>                                    ]  131.2MB/464.5MB","id":"f7aa7fddc751"}
{"status":"Pushing","progressDetail":{"current":96386048,"total":231121686},"progress":"[====================>                              ]  96.39MB/231.1MB","id":"0156efebb8c3"}
{"status":"Pushing","progressDetail":{"current":135060480,"total":464501131},"progress":"[==============>                                    ]  135.1MB/464.5MB","id":"f7aa7fddc751"}
{"status":"Pushing","progressDetail":{"current":100285440,"total":231121686},"progress":"[=====================>                             ]  100.3MB/231.1MB","id":"0156efebb8c3"}
{"status":"Pushing","progressDetail":{"current":138402816,"total":464501131},"progress":"[==============>                                    ]  138.4MB/464.5MB","id":"f7aa7fddc751"}
{"status":"Pushing","progressDetail":{"current":104184832,"total":231121686},"progress":"[======================>                            ]  104.2MB/231.1MB","id":"0156efebb8c3"}
{"status":"Pushing","progressDetail":{"current":142302208,"total":464501131},"progress":"[===============>                                   ]  142.3MB/464.5MB","id":"f7aa7fddc751"}
{"status":"Pushing","progressDetail":{"current":107990016,"total":231121686},"progress":"[=======================>                           ]    108MB/231.1MB","id":"0156efebb8c3"}
{"status":"Pushing","progressDetail":{"current":144530432,"total":464501131},"progress":"[===============>                                   ]  144.5MB/464.5MB","id":"f7aa7fddc751"}
{"status":"Pushing","progressDetail":{"current":113958602,"total":231121686},"progress":"[========================>                          ]    114MB/231.1MB","id":"0156efebb8c3"}
{"status":"Pushing","progressDetail":{"current":146758656,"total":464501131},"progress":"[===============>                                   ]  146.8MB/464.5MB","id":"f7aa7fddc751"}
{"status":"Pushing","progressDetail":{"current":118288453,"total":231121686},"progress":"[=========================>                         ]  118.3MB/231.1MB","id":"0156efebb8c3"}
{"status":"Pushing","progressDetail":{"current":148986880,"total":464501131},"progress":"[================>                                  ]    149MB/464.5MB","id":"f7aa7fddc751"}
{"status":"Pushing","progressDetail":{"current":122006519,"total":231121686},"progress":"[==========================>                        ]    122MB/231.1MB","id":"0156efebb8c3"}
{"status":"Pushing","progressDetail":{"current":152329216,"total":464501131},"progress":"[================>                                  ]  152.3MB/464.5MB","id":"f7aa7fddc751"}
{"status":"Pushing","progressDetail":{"current":125210805,"total":231121686},"progress":"[===========================>                       ]  125.2MB/231.1MB","id":"0156efebb8c3"}
{"status":"Pushing","progressDetail":{"current":155016255,"total":464501131},"progress":"[================>                                  ]    155MB/464.5MB","id":"f7aa7fddc751"}
{"status":"Pushing","progressDetail":{"current":128962560,"total":231121686},"progress":"[===========================>                       ]    129MB/231.1MB","id":"0156efebb8c3"}
{"status":"Pushing","progressDetail":{"current":158349312,"total":464501131},"progress":"[=================>                                 ]  158.3MB/464.5MB","id":"f7aa7fddc751"}
{"status":"Pushing","progressDetail":{"current":133384192,"total":231121686},"progress":"[============================>                      ]  133.4MB/231.1MB","id":"0156efebb8c3"}
{"status":"Pushing","progressDetail":{"current":162187364,"total":464501131},"progress":"[=================>                                 ]  162.2MB/464.5MB","id":"f7aa7fddc751"}
{"status":"Pushing","progressDetail":{"current":137802999,"total":231121686},"progress":"[=============================>                     ]  137.8MB/231.1MB","id":"0156efebb8c3"}
{"status":"Pushing","progressDetail":{"current":164875264,"total":464501131},"progress":"[=================>                                 ]  164.9MB/464.5MB","id":"f7aa7fddc751"}
{"status":"Pushing","progressDetail":{"current":141603328,"total":231121686},"progress":"[==============================>                    ]  141.6MB/231.1MB","id":"0156efebb8c3"}
{"status":"Pushing","progressDetail":{"current":168102912,"total":464501131},"progress":"[==================>                                ]  168.1MB/464.5MB","id":"f7aa7fddc751"}
{"status":"Pushing","progressDetail":{"current":144918528,"total":231121686},"progress":"[===============================>                   ]  144.9MB/231.1MB","id":"0156efebb8c3"}
{"status":"Pushing","progressDetail":{"current":171311401,"total":464501131},"progress":"[==================>                                ]  171.3MB/464.5MB","id":"f7aa7fddc751"}
{"status":"Pushing","progressDetail":{"current":147146752,"total":231121686},"progress":"[===============================>                   ]  147.1MB/231.1MB","id":"0156efebb8c3"}
{"status":"Pushing","progressDetail":{"current":174552064,"total":464501131},"progress":"[==================>                                ]  174.6MB/464.5MB","id":"f7aa7fddc751"}
{"status":"Pushing","progressDetail":{"current":149371904,"total":231121686},"progress":"[================================>                  ]  149.4MB/231.1MB","id":"0156efebb8c3"}
{"status":"Pushing","progressDetail":{"current":177282048,"total":464501131},"progress":"[===================>                               ]  177.3MB/464.5MB","id":"f7aa7fddc751"}
{"status":"Pushing","progressDetail":{"current":151600128,"total":231121686},"progress":"[================================>                  ]  151.6MB/231.1MB","id":"0156efebb8c3"}
{"status":"Pushing","progressDetail":{"current":179982315,"total":464501131},"progress":"[===================>                               ]    180MB/464.5MB","id":"f7aa7fddc751"}
{"status":"Pushing","progressDetail":{"current":153828352,"total":231121686},"progress":"[=================================>                 ]  153.8MB/231.1MB","id":"0156efebb8c3"}
{"status":"Pushing","progressDetail":{"current":183729499,"total":464501131},"progress":"[===================>                               ]  183.7MB/464.5MB","id":"f7aa7fddc751"}
{"status":"Pushing","progressDetail":{"current":156593664,"total":231121686},"progress":"[=================================>                 ]  156.6MB/231.1MB","id":"0156efebb8c3"}
{"status":"Pushing","progressDetail":{"current":187507200,"total":464501131},"progress":"[====================>                              ]  187.5MB/464.5MB","id":"f7aa7fddc751"}
{"status":"Pushing","progressDetail":{"current":158821888,"total":231121686},"progress":"[==================================>                ]  158.8MB/231.1MB","id":"0156efebb8c3"}
{"status":"Pushing","progressDetail":{"current":191238498,"total":464501131},"progress":"[====================>                              ]  191.2MB/464.5MB","id":"f7aa7fddc751"}
{"status":"Pushing","progressDetail":{"current":194481664,"total":464501131},"progress":"[====================>                              ]  194.5MB/464.5MB","id":"f7aa7fddc751"}
{"status":"Pushing","progressDetail":{"current":161596928,"total":231121686},"progress":"[==================================>                ]  161.6MB/231.1MB","id":"0156efebb8c3"}
{"status":"Pushing","progressDetail":{"current":197227008,"total":464501131},"progress":"[=====================>                             ]  197.2MB/464.5MB","id":"f7aa7fddc751"}
{"status":"Pushing","progressDetail":{"current":163801600,"total":231121686},"progress":"[===================================>               ]  163.8MB/231.1MB","id":"0156efebb8c3"}
{"status":"Pushing","progressDetail":{"current":200520192,"total":464501131},"progress":"[=====================>                             ]  200.5MB/464.5MB","id":"f7aa7fddc751"}
{"status":"Pushing","progressDetail":{"current":166488054,"total":231121686},"progress":"[====================================>              ]  166.5MB/231.1MB","id":"0156efebb8c3"}
{"status":"Pushing","progressDetail":{"current":169164800,"total":231121686},"progress":"[====================================>              ]  169.2MB/231.1MB","id":"0156efebb8c3"}
{"status":"Pushing","progressDetail":{"current":203194368,"total":464501131},"progress":"[=====================>                             ]  203.2MB/464.5MB","id":"f7aa7fddc751"}
{"status":"Pushing","progressDetail":{"current":172357675,"total":231121686},"progress":"[=====================================>             ]  172.4MB/231.1MB","id":"0156efebb8c3"}
{"status":"Pushing","progressDetail":{"current":205922816,"total":464501131},"progress":"[======================>                            ]  205.9MB/464.5MB","id":"f7aa7fddc751"}
{"status":"Pushing","progressDetail":{"current":175095808,"total":231121686},"progress":"[=====================================>             ]  175.1MB/231.1MB","id":"0156efebb8c3"}
{"status":"Pushing","progressDetail":{"current":208651776,"total":464501131},"progress":"[======================>                            ]  208.7MB/464.5MB","id":"f7aa7fddc751"}
{"status":"Pushing","progressDetail":{"current":177881088,"total":231121686},"progress":"[======================================>            ]  177.9MB/231.1MB","id":"0156efebb8c3"}
{"status":"Pushing","progressDetail":{"current":211352518,"total":464501131},"progress":"[======================>                            ]  211.4MB/464.5MB","id":"f7aa7fddc751"}
{"status":"Pushing","progressDetail":{"current":180666368,"total":231121686},"progress":"[=======================================>           ]  180.7MB/231.1MB","id":"0156efebb8c3"}
{"status":"Pushing","progressDetail":{"current":214043648,"total":464501131},"progress":"[=======================>                           ]    214MB/464.5MB","id":"f7aa7fddc751"}
{"status":"Pushing","progressDetail":{"current":183890691,"total":231121686},"progress":"[=======================================>           ]  183.9MB/231.1MB","id":"0156efebb8c3"}
{"status":"Pushing","progressDetail":{"current":216730071,"total":464501131},"progress":"[=======================>                           ]  216.7MB/464.5MB","id":"f7aa7fddc751"}
{"status":"Pushing","progressDetail":{"current":219404800,"total":464501131},"progress":"[=======================>                           ]  219.4MB/464.5MB","id":"f7aa7fddc751"}
{"status":"Pushing","progressDetail":{"current":187084288,"total":231121686},"progress":"[========================================>          ]  187.1MB/231.1MB","id":"0156efebb8c3"}
{"status":"Pushing","progressDetail":{"current":222588537,"total":464501131},"progress":"[=======================>                           ]  222.6MB/464.5MB","id":"f7aa7fddc751"}
{"status":"Pushing","progressDetail":{"current":189766875,"total":231121686},"progress":"[=========================================>         ]  189.8MB/231.1MB","id":"0156efebb8c3"}
{"status":"Pushing","progressDetail":{"current":192442156,"total":231121686},"progress":"[=========================================>         ]  192.4MB/231.1MB","id":"0156efebb8c3"}
{"status":"Pushing","progressDetail":{"current":225769657,"total":464501131},"progress":"[========================>                          ]  225.8MB/464.5MB","id":"f7aa7fddc751"}
{"status":"Pushing","progressDetail":{"current":195608576,"total":231121686},"progress":"[==========================================>        ]  195.6MB/231.1MB","id":"0156efebb8c3"}
{"status":"Pushing","progressDetail":{"current":228945599,"total":464501131},"progress":"[========================>                          ]  228.9MB/464.5MB","id":"f7aa7fddc751"}
{"status":"Pushing","progressDetail":{"current":198812513,"total":231121686},"progress":"[===========================================>       ]  198.8MB/231.1MB","id":"0156efebb8c3"}
{"status":"Pushing","progressDetail":{"current":232144896,"total":464501131},"progress":"[========================>                          ]  232.1MB/464.5MB","id":"f7aa7fddc751"}
{"status":"Pushing","progressDetail":{"current":202619904,"total":231121686},"progress":"[===========================================>       ]  202.6MB/231.1MB","id":"0156efebb8c3"}
{"status":"Pushing","progressDetail":{"current":235375377,"total":464501131},"progress":"[=========================>                         ]  235.4MB/464.5MB","id":"f7aa7fddc751"}
{"status":"Pushing","progressDetail":{"current":206483456,"total":231121686},"progress":"[============================================>      ]  206.5MB/231.1MB","id":"0156efebb8c3"}
{"status":"Pushing","progressDetail":{"current":238552515,"total":464501131},"progress":"[=========================>                         ]  238.6MB/464.5MB","id":"f7aa7fddc751"}
{"status":"Pushing","progressDetail":{"current":241763395,"total":464501131},"progress":"[==========================>                        ]  241.8MB/464.5MB","id":"f7aa7fddc751"}
{"status":"Pushing","progressDetail":{"current":209654123,"total":231121686},"progress":"[=============================================>     ]  209.7MB/231.1MB","id":"0156efebb8c3"}
{"status":"Pushing","progressDetail":{"current":212843569,"total":231121686},"progress":"[==============================================>    ]  212.8MB/231.1MB","id":"0156efebb8c3"}
{"status":"Pushing","progressDetail":{"current":245013159,"total":464501131},"progress":"[==========================>                        ]    245MB/464.5MB","id":"f7aa7fddc751"}
{"status":"Pushing","progressDetail":{"current":247721472,"total":464501131},"progress":"[==========================>                        ]  247.7MB/464.5MB","id":"f7aa7fddc751"}
{"status":"Pushing","progressDetail":{"current":216580920,"total":231121686},"progress":"[==============================================>    ]  216.6MB/231.1MB","id":"0156efebb8c3"}
{"status":"Pushing","progressDetail":{"current":250473472,"total":464501131},"progress":"[==========================>                        ]  250.5MB/464.5MB","id":"f7aa7fddc751"}
{"status":"Pushing","progressDetail":{"current":220326912,"total":231121686},"progress":"[===============================================>   ]  220.3MB/231.1MB","id":"0156efebb8c3"}
{"status":"Pushing","progressDetail":{"current":255995392,"total":464501131},"progress":"[===========================>                       ]    256MB/464.5MB","id":"f7aa7fddc751"}
{"status":"Pushing","progressDetail":{"current":223669248,"total":231121686},"progress":"[================================================>  ]  223.7MB/231.1MB","id":"0156efebb8c3"}
{"status":"Pushing","progressDetail":{"current":259871744,"total":464501131},"progress":"[===========================>                       ]  259.9MB/464.5MB","id":"f7aa7fddc751"}
{"status":"Pushing","progressDetail":{"current":227011584,"total":231121686},"progress":"[=================================================> ]    227MB/231.1MB","id":"0156efebb8c3"}
{"status":"Pushing","progressDetail":{"current":263749120,"total":464501131},"progress":"[============================>                      ]  263.7MB/464.5MB","id":"f7aa7fddc751"}
{"status":"Pushing","progressDetail":{"current":230353920,"total":231121686},"progress":"[=================================================> ]  230.4MB/231.1MB","id":"0156efebb8c3"}
{"status":"Pushing","progressDetail":{"current":267637248,"total":464501131},"progress":"[============================>                      ]  267.6MB/464.5MB","id":"f7aa7fddc751"}
{"status":"Pushing","progressDetail":{"current":233696256,"total":231121686},"progress":"[==================================================>]  233.7MB","id":"0156efebb8c3"}
{"status":"Pushing","progressDetail":{"current":271529984,"total":464501131},"progress":"[=============================>                     ]  271.5MB/464.5MB","id":"f7aa7fddc751"}
{"status":"Pushing","progressDetail":{"current":237011968,"total":231121686},"progress":"[==================================================>]    237MB","id":"0156efebb8c3"}
{"status":"Pushing","progressDetail":{"current":278199296,"total":464501131},"progress":"[=============================>                     ]  278.2MB/464.5MB","id":"f7aa7fddc751"}
{"status":"Pushing","progressDetail":{"current":238991872,"total":231121686},"progress":"[==================================================>]    239MB","id":"0156efebb8c3"}
{"status":"Pushing","progressDetail":{"current":284326912,"total":464501131},"progress":"[==============================>                    ]  284.3MB/464.5MB","id":"f7aa7fddc751"}
{"status":"Pushing","progressDetail":{"current":287656448,"total":464501131},"progress":"[==============================>                    ]  287.7MB/464.5MB","id":"f7aa7fddc751"}
{"status":"Pushing","progressDetail":{"current":293784064,"total":464501131},"progress":"[===============================>                   ]  293.8MB/464.5MB","id":"f7aa7fddc751"}
{"status":"Pushing","progressDetail":{"current":297660928,"total":464501131},"progress":"[================================>                  ]  297.7MB/464.5MB","id":"f7aa7fddc751"}
{"status":"Pushing","progressDetail":{"current":303209472,"total":464501131},"progress":"[================================>                  ]  303.2MB/464.5MB","id":"f7aa7fddc751"}
{"status":"Pushing","progressDetail":{"current":308751872,"total":464501131},"progress":"[=================================>                 ]  308.8MB/464.5MB","id":"f7aa7fddc751"}
{"status":"Pushing","progressDetail":{"current":315436544,"total":464501131},"progress":"[=================================>                 ]  315.4MB/464.5MB","id":"f7aa7fddc751"}
{"status":"Pushing","progressDetail":{"current":318720512,"total":464501131},"progress":"[==================================>                ]  318.7MB/464.5MB","id":"f7aa7fddc751"}
{"status":"Pushing","progressDetail":{"current":327633408,"total":464501131},"progress":"[===================================>               ]  327.6MB/464.5MB","id":"f7aa7fddc751"}
{"status":"Pushing","progressDetail":{"current":331515392,"total":464501131},"progress":"[===================================>               ]  331.5MB/464.5MB","id":"f7aa7fddc751"}
{"status":"Pushed","progressDetail":{},"id":"0156efebb8c3"}
{"status":"Pushing","progressDetail":{"current":337073664,"total":464501131},"progress":"[====================================>              ]  337.1MB/464.5MB","id":"f7aa7fddc751"}
{"status":"Pushing","progressDetail":{"current":342644224,"total":464501131},"progress":"[====================================>              ]  342.6MB/464.5MB","id":"f7aa7fddc751"}
{"status":"Pushing","progressDetail":{"current":346444786,"total":464501131},"progress":"[=====================================>             ]  346.4MB/464.5MB","id":"f7aa7fddc751"}
{"status":"Pushing","progressDetail":{"current":350215680,"total":464501131},"progress":"[=====================================>             ]  350.2MB/464.5MB","id":"f7aa7fddc751"}
{"status":"Pushing","progressDetail":{"current":354587195,"total":464501131},"progress":"[======================================>            ]  354.6MB/464.5MB","id":"f7aa7fddc751"}
{"status":"Pushing","progressDetail":{"current":357829940,"total":464501131},"progress":"[======================================>            ]  357.8MB/464.5MB","id":"f7aa7fddc751"}
{"status":"Pushing","progressDetail":{"current":361060864,"total":464501131},"progress":"[======================================>            ]  361.1MB/464.5MB","id":"f7aa7fddc751"}
{"status":"Pushing","progressDetail":{"current":364914176,"total":464501131},"progress":"[=======================================>           ]  364.9MB/464.5MB","id":"f7aa7fddc751"}
{"status":"Pushing","progressDetail":{"current":369370624,"total":464501131},"progress":"[=======================================>           ]  369.4MB/464.5MB","id":"f7aa7fddc751"}
{"status":"Pushing","progressDetail":{"current":374384128,"total":464501131},"progress":"[========================================>          ]  374.4MB/464.5MB","id":"f7aa7fddc751"}
{"status":"Pushing","progressDetail":{"current":378283520,"total":464501131},"progress":"[========================================>          ]  378.3MB/464.5MB","id":"f7aa7fddc751"}
{"status":"Pushing","progressDetail":{"current":382182912,"total":464501131},"progress":"[=========================================>         ]  382.2MB/464.5MB","id":"f7aa7fddc751"}
{"status":"Pushing","progressDetail":{"current":384968192,"total":464501131},"progress":"[=========================================>         ]    385MB/464.5MB","id":"f7aa7fddc751"}
{"status":"Pushing","progressDetail":{"current":387196416,"total":464501131},"progress":"[=========================================>         ]  387.2MB/464.5MB","id":"f7aa7fddc751"}
{"status":"Pushing","progressDetail":{"current":389424640,"total":464501131},"progress":"[=========================================>         ]  389.4MB/464.5MB","id":"f7aa7fddc751"}
{"status":"Pushing","progressDetail":{"current":392209920,"total":464501131},"progress":"[==========================================>        ]  392.2MB/464.5MB","id":"f7aa7fddc751"}
{"status":"Pushing","progressDetail":{"current":395501568,"total":464501131},"progress":"[==========================================>        ]  395.5MB/464.5MB","id":"f7aa7fddc751"}
{"status":"Pushing","progressDetail":{"current":398717635,"total":464501131},"progress":"[==========================================>        ]  398.7MB/464.5MB","id":"f7aa7fddc751"}
{"status":"Pushing","progressDetail":{"current":401958400,"total":464501131},"progress":"[===========================================>       ]    402MB/464.5MB","id":"f7aa7fddc751"}
{"status":"Pushing","progressDetail":{"current":405166838,"total":464501131},"progress":"[===========================================>       ]  405.2MB/464.5MB","id":"f7aa7fddc751"}
{"status":"Pushing","progressDetail":{"current":409024512,"total":464501131},"progress":"[============================================>      ]    409MB/464.5MB","id":"f7aa7fddc751"}
{"status":"Pushing","progressDetail":{"current":412811264,"total":464501131},"progress":"[============================================>      ]  412.8MB/464.5MB","id":"f7aa7fddc751"}
{"status":"Pushing","progressDetail":{"current":416650752,"total":464501131},"progress":"[============================================>      ]  416.7MB/464.5MB","id":"f7aa7fddc751"}
{"status":"Pushing","progressDetail":{"current":419393024,"total":464501131},"progress":"[=============================================>     ]  419.4MB/464.5MB","id":"f7aa7fddc751"}
{"status":"Pushing","progressDetail":{"current":422647881,"total":464501131},"progress":"[=============================================>     ]  422.6MB/464.5MB","id":"f7aa7fddc751"}
{"status":"Pushing","progressDetail":{"current":425903311,"total":464501131},"progress":"[=============================================>     ]  425.9MB/464.5MB","id":"f7aa7fddc751"}
{"status":"Pushing","progressDetail":{"current":429125632,"total":464501131},"progress":"[==============================================>    ]  429.1MB/464.5MB","id":"f7aa7fddc751"}
{"status":"Pushing","progressDetail":{"current":433569280,"total":464501131},"progress":"[==============================================>    ]  433.6MB/464.5MB","id":"f7aa7fddc751"}
{"status":"Pushing","progressDetail":{"current":436776960,"total":464501131},"progress":"[===============================================>   ]  436.8MB/464.5MB","id":"f7aa7fddc751"}
{"status":"Pushing","progressDetail":{"current":440006144,"total":464501131},"progress":"[===============================================>   ]    440MB/464.5MB","id":"f7aa7fddc751"}
{"status":"Pushing","progressDetail":{"current":442176512,"total":464501131},"progress":"[===============================================>   ]  442.2MB/464.5MB","id":"f7aa7fddc751"}
{"status":"Pushing","progressDetail":{"current":444919808,"total":464501131},"progress":"[===============================================>   ]  444.9MB/464.5MB","id":"f7aa7fddc751"}
{"status":"Pushing","progressDetail":{"current":447705088,"total":464501131},"progress":"[================================================>  ]  447.7MB/464.5MB","id":"f7aa7fddc751"}
{"status":"Pushing","progressDetail":{"current":450441728,"total":464501131},"progress":"[================================================>  ]  450.4MB/464.5MB","id":"f7aa7fddc751"}
{"status":"Pushing","progressDetail":{"current":453694976,"total":464501131},"progress":"[================================================>  ]  453.7MB/464.5MB","id":"f7aa7fddc751"}
{"status":"Pushing","progressDetail":{"current":458549112,"total":464501131},"progress":"[=================================================> ]  458.5MB/464.5MB","id":"f7aa7fddc751"}
{"status":"Pushing","progressDetail":{"current":461774336,"total":464501131},"progress":"[=================================================> ]  461.8MB/464.5MB","id":"f7aa7fddc751"}
{"status":"Pushing","progressDetail":{"current":465063424,"total":464501131},"progress":"[==================================================>]  465.1MB","id":"f7aa7fddc751"}
{"status":"Pushing","progressDetail":{"current":468833353,"total":464501131},"progress":"[==================================================>]  468.8MB","id":"f7aa7fddc751"}
{"status":"Pushing","progressDetail":{"current":471487074,"total":464501131},"progress":"[==================================================>]  471.5MB","id":"f7aa7fddc751"}
{"status":"Pushing","progressDetail":{"current":473860608,"total":464501131},"progress":"[==================================================>]  473.9MB","id":"f7aa7fddc751"}
{"status":"Pushed","progressDetail":{},"id":"f7aa7fddc751"}
{"status":"1.1.1-release-1: digest: sha256:1e7b3b2918d55b0a7b6088125703788b310c4056b0fffddb87ce95820c701b34 size: 3689"}
{"progressDetail":{},"aux":{"Tag":"1.1.1-release-1","Digest":"sha256:1e7b3b2918d55b0a7b6088125703788b310c4056b0fffddb87ce95820c701b34","Size":3689}}
