{"stream": "Step 1/9 : FROM python:3.7-slim-stretch"}
{"stream": "\n"}
{"status": "Pulling from library/python", "id": "3.7-slim-stretch"}
{"status": "Pulling fs layer", "progressDetail": {}, "id": "aed007321795"}
{"status": "Pulling fs layer", "progressDetail": {}, "id": "8f16ed85ea43"}
{"status": "Pulling fs layer", "progressDetail": {}, "id": "91f107964f00"}
{"status": "Pulling fs layer", "progressDetail": {}, "id": "1297e7d7c962"}
{"status": "Pulling fs layer", "progressDetail": {}, "id": "68ff5953cea4"}
{"status": "Waiting", "progressDetail": {}, "id": "1297e7d7c962"}
{"status": "Waiting", "progressDetail": {}, "id": "68ff5953cea4"}
{"status": "Downloading", "progressDetail": {"current": 25297, "total": 2506186}, "progress": "[>                                                  ]   25.3kB/2.506MB", "id": "8f16ed85ea43"}
{"status": "Downloading", "progressDetail": {"current": 228591, "total": 22528174}, "progress": "[>                                                  ]  228.6kB/22.53MB", "id": "aed007321795"}
{"status": "Verifying Checksum", "progressDetail": {}, "id": "8f16ed85ea43"}
{"status": "Download complete", "progressDetail": {}, "id": "8f16ed85ea43"}
{"status": "Downloading", "progressDetail": {"current": 103751, "total": 10003039}, "progress": "[>                                                  ]  103.8kB/10MB", "id": "91f107964f00"}
{"status": "Downloading", "progressDetail": {"current": 3966013, "total": 10003039}, "progress": "[===================>                               ]  3.966MB/10MB", "id": "91f107964f00"}
{"status": "Downloading", "progressDetail": {"current": 1157558, "total": 22528174}, "progress": "[==>                                                ]  1.158MB/22.53MB", "id": "aed007321795"}
{"status": "Downloading", "progressDetail": {"current": 240, "total": 240}, "progress": "[==================================================>]     240B/240B", "id": "1297e7d7c962"}
{"status": "Verifying Checksum", "progressDetail": {}, "id": "1297e7d7c962"}
{"status": "Download complete", "progressDetail": {}, "id": "1297e7d7c962"}
{"status": "Downloading", "progressDetail": {"current": 6849597, "total": 10003039}, "progress": "[==================================>                ]   6.85MB/10MB", "id": "91f107964f00"}
{"status": "Downloading", "progressDetail": {"current": 7170486, "total": 22528174}, "progress": "[===============>                                   ]   7.17MB/22.53MB", "id": "aed007321795"}
{"status": "Verifying Checksum", "progressDetail": {}, "id": "91f107964f00"}
{"status": "Download complete", "progressDetail": {}, "id": "91f107964f00"}
{"status": "Downloading", "progressDetail": {"current": 13183414, "total": 22528174}, "progress": "[=============================>                     ]  13.18MB/22.53MB", "id": "aed007321795"}
{"status": "Downloading", "progressDetail": {"current": 26679, "total": 2630908}, "progress": "[>                                                  ]  26.68kB/2.631MB", "id": "68ff5953cea4"}
{"status": "Downloading", "progressDetail": {"current": 21744054, "total": 22528174}, "progress": "[================================================>  ]  21.74MB/22.53MB", "id": "aed007321795"}
{"status": "Verifying Checksum", "progressDetail": {}, "id": "aed007321795"}
{"status": "Download complete", "progressDetail": {}, "id": "aed007321795"}
{"status": "Extracting", "progressDetail": {"current": 229376, "total": 22528174}, "progress": "[>                                                  ]  229.4kB/22.53MB", "id": "aed007321795"}
{"status": "Verifying Checksum", "progressDetail": {}, "id": "68ff5953cea4"}
{"status": "Download complete", "progressDetail": {}, "id": "68ff5953cea4"}
{"status": "Extracting", "progressDetail": {"current": 3211264, "total": 22528174}, "progress": "[=======>                                           ]  3.211MB/22.53MB", "id": "aed007321795"}
{"status": "Extracting", "progressDetail": {"current": 5963776, "total": 22528174}, "progress": "[=============>                                     ]  5.964MB/22.53MB", "id": "aed007321795"}
{"status": "Extracting", "progressDetail": {"current": 9404416, "total": 22528174}, "progress": "[====================>                              ]  9.404MB/22.53MB", "id": "aed007321795"}
{"status": "Extracting", "progressDetail": {"current": 13074432, "total": 22528174}, "progress": "[=============================>                     ]  13.07MB/22.53MB", "id": "aed007321795"}
{"status": "Extracting", "progressDetail": {"current": 16285696, "total": 22528174}, "progress": "[====================================>              ]  16.29MB/22.53MB", "id": "aed007321795"}
{"status": "Extracting", "progressDetail": {"current": 19955712, "total": 22528174}, "progress": "[============================================>      ]  19.96MB/22.53MB", "id": "aed007321795"}
{"status": "Extracting", "progressDetail": {"current": 21561344, "total": 22528174}, "progress": "[===============================================>   ]  21.56MB/22.53MB", "id": "aed007321795"}
{"status": "Extracting", "progressDetail": {"current": 22528174, "total": 22528174}, "progress": "[==================================================>]  22.53MB/22.53MB", "id": "aed007321795"}
{"status": "Pull complete", "progressDetail": {}, "id": "aed007321795"}
{"status": "Extracting", "progressDetail": {"current": 32768, "total": 2506186}, "progress": "[>                                                  ]  32.77kB/2.506MB", "id": "8f16ed85ea43"}
{"status": "Extracting", "progressDetail": {"current": 2097152, "total": 2506186}, "progress": "[=========================================>         ]  2.097MB/2.506MB", "id": "8f16ed85ea43"}
{"status": "Extracting", "progressDetail": {"current": 2506186, "total": 2506186}, "progress": "[==================================================>]  2.506MB/2.506MB", "id": "8f16ed85ea43"}
{"status": "Pull complete", "progressDetail": {}, "id": "8f16ed85ea43"}
{"status": "Extracting", "progressDetail": {"current": 131072, "total": 10003039}, "progress": "[>                                                  ]  131.1kB/10MB", "id": "91f107964f00"}
{"status": "Extracting", "progressDetail": {"current": 1048576, "total": 10003039}, "progress": "[=====>                                             ]  1.049MB/10MB", "id": "91f107964f00"}
{"status": "Extracting", "progressDetail": {"current": 1966080, "total": 10003039}, "progress": "[=========>                                         ]  1.966MB/10MB", "id": "91f107964f00"}
{"status": "Extracting", "progressDetail": {"current": 3407872, "total": 10003039}, "progress": "[=================>                                 ]  3.408MB/10MB", "id": "91f107964f00"}
{"status": "Extracting", "progressDetail": {"current": 6684672, "total": 10003039}, "progress": "[=================================>                 ]  6.685MB/10MB", "id": "91f107964f00"}
{"status": "Extracting", "progressDetail": {"current": 9437184, "total": 10003039}, "progress": "[===============================================>   ]  9.437MB/10MB", "id": "91f107964f00"}
{"status": "Extracting", "progressDetail": {"current": 10003039, "total": 10003039}, "progress": "[==================================================>]     10MB/10MB", "id": "91f107964f00"}
{"status": "Pull complete", "progressDetail": {}, "id": "91f107964f00"}
{"status": "Extracting", "progressDetail": {"current": 240, "total": 240}, "progress": "[==================================================>]     240B/240B", "id": "1297e7d7c962"}
{"status": "Extracting", "progressDetail": {"current": 240, "total": 240}, "progress": "[==================================================>]     240B/240B", "id": "1297e7d7c962"}
{"status": "Pull complete", "progressDetail": {}, "id": "1297e7d7c962"}
{"status": "Extracting", "progressDetail": {"current": 32768, "total": 2630908}, "progress": "[>                                                  ]  32.77kB/2.631MB", "id": "68ff5953cea4"}
{"status": "Extracting", "progressDetail": {"current": 98304, "total": 2630908}, "progress": "[=>                                                 ]   98.3kB/2.631MB", "id": "68ff5953cea4"}
{"status": "Extracting", "progressDetail": {"current": 1179648, "total": 2630908}, "progress": "[======================>                            ]   1.18MB/2.631MB", "id": "68ff5953cea4"}
{"status": "Extracting", "progressDetail": {"current": 2162688, "total": 2630908}, "progress": "[=========================================>         ]  2.163MB/2.631MB", "id": "68ff5953cea4"}
{"status": "Extracting", "progressDetail": {"current": 2630908, "total": 2630908}, "progress": "[==================================================>]  2.631MB/2.631MB", "id": "68ff5953cea4"}
{"status": "Pull complete", "progressDetail": {}, "id": "68ff5953cea4"}
{"status": "Digest: sha256:347a9c53c755677aff88ad1731385bf135dc99963914754e70023f271d1ae2ef"}
{"status": "Status: Downloaded newer image for python:3.7-slim-stretch"}
{"stream": " ---> 1e949fc52c31\n"}
{"stream": "Step 2/9 : MAINTAINER Flywheel <support@flywheel.io>"}
{"stream": "\n"}
{"stream": " ---> Running in d51bf5fe0c13\n"}
{"stream": "Removing intermediate container d51bf5fe0c13\n"}
{"stream": " ---> 80cbe5626cb5\n"}
{"stream": "Step 3/9 : ENV FLYWHEEL=\"/flywheel/v0\""}
{"stream": "\n"}
{"stream": " ---> Running in 70c2ef9bd572\n"}
{"stream": "Removing intermediate container 70c2ef9bd572\n"}
{"stream": " ---> a22833388b84\n"}
{"stream": "Step 4/9 : COPY [\"requirements.txt\", \"/opt/requirements.txt\"]"}
{"stream": "\n"}
{"stream": " ---> 45f6da4af919\n"}
{"stream": "Step 5/9 : RUN pip install -r /opt/requirements.txt     && mkdir -p $FLYWHEEL     && useradd --no-user-group --create-home --shell /bin/bash flywheel"}
{"stream": "\n"}
{"stream": " ---> Running in 1a894e7fc77f\n"}
{"stream": "Collecting jsonschema~=3.2.0\n"}
{"stream": "  Downloading jsonschema-3.2.0-py2.py3-none-any.whl (56 kB)\n"}
{"stream": "Collecting nibabel~=3.0.1\n"}
{"stream": "  Downloading nibabel-3.0.2-py3-none-any.whl (3.3 MB)\n"}
{"stream": "Collecting pydicom~=2.0.0\n"}
{"stream": "  Downloading pydicom-2.0.0-py3-none-any.whl (35.4 MB)\n"}
{"stream": "Collecting pytz~=2019.3\n"}
{"stream": "  Downloading pytz-2019.3-py2.py3-none-any.whl (509 kB)\n"}
{"stream": "Collecting tzlocal~=2.0.0\n"}
{"stream": "  Downloading tzlocal-2.0.0-py2.py3-none-any.whl (15 kB)\n"}
{"stream": "Collecting pandas~=1.0.1\n"}
{"stream": "  Downloading pandas-1.0.5-cp37-cp37m-manylinux1_x86_64.whl (10.1 MB)\n"}
{"stream": "Collecting flywheel-sdk~=11.0.1\n"}
{"stream": "  Downloading flywheel_sdk-11.0.1-py2.py3-none-any.whl (662 kB)\n"}
{"stream": "Collecting backoff~=1.10.0\n"}
{"stream": "  Downloading backoff-1.10.0-py2.py3-none-any.whl (31 kB)\n"}
{"stream": "Collecting pyrsistent>=0.14.0\n"}
{"stream": "  Downloading pyrsistent-0.18.0-cp37-cp37m-manylinux1_x86_64.whl (119 kB)\n"}
{"stream": "Requirement already satisfied: setuptools in /usr/local/lib/python3.7/site-packages (from jsonschema~=3.2.0->-r /opt/requirements.txt (line 1)) (57.0.0)\n"}
{"stream": "Collecting attrs>=17.4.0\n"}
{"stream": "  Downloading attrs-21.2.0-py2.py3-none-any.whl (53 kB)\n"}
{"stream": "Collecting six>=1.11.0\n"}
{"stream": "  Downloading six-1.16.0-py2.py3-none-any.whl (11 kB)\n"}
{"stream": "Collecting importlib-metadata\n"}
{"stream": "  Downloading importlib_metadata-4.6.1-py3-none-any.whl (17 kB)\n"}
{"stream": "Collecting numpy>=1.12\n"}
{"stream": "  Downloading numpy-1.21.0-cp37-cp37m-manylinux_2_12_x86_64.manylinux2010_x86_64.whl (15.7 MB)\n"}
{"stream": "Collecting python-dateutil>=2.6.1\n"}
{"stream": "  Downloading python_dateutil-2.8.2-py2.py3-none-any.whl (247 kB)\n"}
{"stream": "Collecting urllib3>=1.15\n"}
{"stream": "  Downloading urllib3-1.26.6-py2.py3-none-any.whl (138 kB)\n"}
{"stream": "Collecting certifi\n"}
{"stream": "  Downloading certifi-2021.5.30-py2.py3-none-any.whl (145 kB)\n"}
{"stream": "Collecting requests>=2.18.4\n"}
{"stream": "  Downloading requests-2.26.0-py2.py3-none-any.whl (62 kB)\n"}
{"stream": "Collecting requests-toolbelt\n"}
{"stream": "  Downloading requests_toolbelt-0.9.1-py2.py3-none-any.whl (54 kB)\n"}
{"stream": "Collecting charset-normalizer~=2.0.0\n"}
{"stream": "  Downloading charset_normalizer-2.0.3-py3-none-any.whl (35 kB)\n"}
{"stream": "Collecting idna<4,>=2.5\n"}
{"stream": "  Downloading idna-3.2-py3-none-any.whl (59 kB)\n"}
{"stream": "Collecting typing-extensions>=3.6.4\n"}
{"stream": "  Downloading typing_extensions-3.10.0.0-py3-none-any.whl (26 kB)\n"}
{"stream": "Collecting zipp>=0.5\n"}
{"stream": "  Downloading zipp-3.5.0-py3-none-any.whl (5.7 kB)\n"}
{"stream": "Installing collected packages: urllib3, idna, charset-normalizer, certifi, zipp, typing-extensions, six, requests, requests-toolbelt, pytz, python-dateutil, pyrsistent, numpy, importlib-metadata, attrs, tzlocal, pydicom, pandas, nibabel, jsonschema, flywheel-sdk, backoff\n"}
{"stream": "Successfully installed attrs-21.2.0 backoff-1.10.0 certifi-2021.5.30 charset-normalizer-2.0.3 flywheel-sdk-11.0.1 idna-3.2 importlib-metadata-4.6.1 jsonschema-3.2.0 nibabel-3.0.2 numpy-1.21.0 pandas-1.0.5 pydicom-2.0.0 pyrsistent-0.18.0 python-dateutil-2.8.2 pytz-2019.3 requests-2.26.0 requests-toolbelt-0.9.1 six-1.16.0 typing-extensions-3.10.0.0 tzlocal-2.0.0 urllib3-1.26.6 zipp-3.5.0\n"}
{"stream": "\u001b[91mWARNING: Running pip as the 'root' user can result in broken permissions and conflicting behaviour with the system package manager. It is recommended to use a virtual environment instead: https://pip.pypa.io/warnings/venv\n\u001b[0m"}
{"stream": "Removing intermediate container 1a894e7fc77f\n"}
{"stream": " ---> fe72c4a7ff6e\n"}
{"stream": "Step 6/9 : COPY utils $FLYWHEEL/utils"}
{"stream": "\n"}
{"stream": " ---> 2e1587355407\n"}
{"stream": "Step 7/9 : COPY run.py manifest.json $FLYWHEEL/"}
{"stream": "\n"}
{"stream": " ---> bf6591fed4a9\n"}
{"stream": "Step 8/9 : RUN chmod +x $FLYWHEEL/run.py"}
{"stream": "\n"}
{"stream": " ---> Running in fd22d74e714a\n"}
{"stream": "Removing intermediate container fd22d74e714a\n"}
{"stream": " ---> 84d58afedb52\n"}
{"stream": "Step 9/9 : WORKDIR $FLYWHEEL"}
{"stream": "\n"}
{"stream": " ---> Running in c48338dd775a\n"}
{"stream": "Removing intermediate container c48338dd775a\n"}
{"stream": " ---> 15d93703937c\n"}
{"aux": {"ID": "sha256:15d93703937c4252ecd07044402b925a0bee7e3736bb8d8f3c504a5cb1541273"}}
{"stream": "Successfully built 15d93703937c\n"}
{"stream": "Successfully tagged flywheel/metadata-import-dicom:2.8.4\n"}
