{
	"info": {
		"header": {
			"dicom": {
				"FileMetaInformationGroupLength": 196,
				"MediaStorageSOPClassUID": "1.2.840.10008.5.1.4.1.1.2",
				"TransferSyntaxUID": "1.2.840.10008.1.2.1",
				"ImplementationClassUID": "1.2.40.0.13.1.1.1",
				"ImplementationVersionName": "dcm4che-1.4.35",
				"SpecificCharacterSet": "ISO_IR 100",
				"ImageType": [
					"DERIVED",
					"PRIMARY",
					"AXIAL",
					"CT_SOM5 SPO"
				],
				"SOPClassUID": "1.2.840.10008.5.1.4.1.1.2",
				"Modality": "CT",
				"Manufacturer": "SIEMENS",
				"ManufacturerModelName": "Sensation 64",
				"PatientIdentityRemoved": "YES",
				"DeidentificationMethod": "Per DICOM PS 3.15 AnnexE. Details in 0012,0064",
				"DeidentificationMethodCodeSequence": [
					{
						"CodeMeaning": "Basic Application Confidentiality Profile",
						"CodeValue": "113100",
						"CodingSchemeDesignator": "DCM"
					},
					{
						"CodeMeaning": "Clean Pixel Data Option",
						"CodeValue": "113101",
						"CodingSchemeDesignator": "DCM"
					},
					{
						"CodeMeaning": "Clean Structured Content Option",
						"CodeValue": "113104",
						"CodingSchemeDesignator": "DCM"
					},
					{
						"CodeMeaning": "Clean Descriptors Option",
						"CodeValue": "113105",
						"CodingSchemeDesignator": "DCM"
					},
					{
						"CodeMeaning": "Retain Longitudinal Temporal Information Modified Dates Option",
						"CodeValue": "113107",
						"CodingSchemeDesignator": "DCM"
					},
					{
						"CodeMeaning": "Retain Patient Characteristics Option",
						"CodeValue": "113108",
						"CodingSchemeDesignator": "DCM"
					},
					{
						"CodeMeaning": "Retain Device Identity Option",
						"CodeValue": "113109",
						"CodingSchemeDesignator": "DCM"
					},
					{
						"CodeMeaning": "Retain Safe Private Option",
						"CodeValue": "113111",
						"CodingSchemeDesignator": "DCM"
					}
				],
				"BodyPartExamined": "LIVER",
				"SliceThickness": 3,
				"KVP": 120,
				"DataCollectionDiameter": 500,
				"SoftwareVersions": "syngo CT 2007S",
				"ContrastBolusVolume": 0,
				"ContrastFlowRate": 0,
				"ContrastFlowDuration": 0,
				"ContrastBolusIngredientConcentration": 0,
				"ReconstructionDiameter": 359,
				"DistanceSourceToDetector": 1040,
				"DistanceSourceToPatient": 570,
				"GantryDetectorTilt": 0,
				"TableHeight": 167,
				"RotationDirection": "CW",
				"ExposureTime": 500,
				"XRayTubeCurrent": 338,
				"Exposure": 169,
				"FilterType": "0",
				"GeneratorPower": 40,
				"FocalSpots": 1.2,
				"ConvolutionKernel": "B31f",
				"PatientPosition": "FFS",
				"ContributingEquipmentSequence": [
					{
						"Manufacturer": "Flywheel",
						"ManufacturerModelName": "fw_gear_splitter",
						"SoftwareVersions": "1.4.3"
					}
				],
				"SeriesNumber": 7,
				"AcquisitionNumber": 12,
				"InstanceNumber": 2,
				"ImagePositionPatient": [
					-171.3914140625,
					-280.674,
					35.8994140625
				],
				"ImageOrientationPatient": [
					1,
					0,
					0,
					0,
					0,
					-1
				],
				"SamplesPerPixel": 1,
				"PhotometricInterpretation": "MONOCHROME2",
				"Rows": 512,
				"Columns": 512,
				"PixelSpacing": [
					0.701171875,
					0.701171875
				],
				"BitsAllocated": 16,
				"BitsStored": 12,
				"HighBit": 11,
				"PixelRepresentation": 0,
				"SmallestImagePixelValue": 0,
				"LargestImagePixelValue": 1634,
				"LongitudinalTemporalInformationModified": "MODIFIED",
				"WindowCenter": [
					50,
					-700
				],
				"WindowWidth": [
					350,
					1500
				],
				"RescaleIntercept": -1024,
				"RescaleSlope": 1,
				"WindowCenterWidthExplanation": [
					"WINDOW1",
					"WINDOW2"
				],
				"StudyStatusID": "READ"
			}
		}
	},
	"file_id": "655575fe8e2d23de9e9d1839",
	"url": "latest.sse.flywheel.io/ohif-viewer/project/65f467743908b97973678a1c/viewer/1.3.6.1.4.1.14519.5.2.1.1079.4008.328820149586454940911187796566/1.3.6.1.4.1.14519.5.2.1.1079.4008.161686441012277956341337038260",
	"zip_member_count": 132,
	"type": "dicom",
	"name": "series-7_CT_Arterial Liver Coronal.dicom.zip"
}