{
	"info": {
		"header": {
			"dicom": {
				"FileMetaInformationGroupLength": 206,
				"MediaStorageSOPClassUID": "1.2.840.10008.5.1.4.1.1.2",
				"TransferSyntaxUID": "1.2.840.10008.1.2.1",
				"ImplementationClassUID": "1.3.6.1.4.1.22213.1.143",
				"ImplementationVersionName": "0.5",
				"SourceApplicationEntityTitle": "POSDA",
				"SpecificCharacterSet": "ISO_IR 100",
				"ImageType": [
					"ORIGINAL",
					"PRIMARY",
					"AXIAL"
				],
				"SOPClassUID": "1.2.840.10008.5.1.4.1.1.2",
				"Modality": "CT",
				"Manufacturer": "Philips",
				"ManufacturerModelName": "iCT 256",
				"PatientIdentityRemoved": "YES",
				"DeidentificationMethod": "Per DICOM PS 3.15 AnnexE. Details in 0012,0064",
				"DeidentificationMethodCodeSequence": [
					{
						"CodeMeaning": "Basic Application Confidentiality Profile",
						"CodeValue": "113100",
						"CodingSchemeDesignator": "DCM"
					},
					{
						"CodeMeaning": "Clean Pixel Data Option",
						"CodeValue": "113101",
						"CodingSchemeDesignator": "DCM"
					},
					{
						"CodeMeaning": "Clean Structured Content Option",
						"CodeValue": "113104",
						"CodingSchemeDesignator": "DCM"
					},
					{
						"CodeMeaning": "Clean Descriptors Option",
						"CodeValue": "113105",
						"CodingSchemeDesignator": "DCM"
					},
					{
						"CodeMeaning": "Retain Longitudinal Temporal Information Modified Dates Option",
						"CodeValue": "113107",
						"CodingSchemeDesignator": "DCM"
					},
					{
						"CodeMeaning": "Retain Patient Characteristics Option",
						"CodeValue": "113108",
						"CodingSchemeDesignator": "DCM"
					},
					{
						"CodeMeaning": "Retain Device Identity Option",
						"CodeValue": "113109",
						"CodingSchemeDesignator": "DCM"
					},
					{
						"CodeMeaning": "Retain Safe Private Option",
						"CodeValue": "113111",
						"CodingSchemeDesignator": "DCM"
					}
				],
				"BodyPartExamined": "CHEST",
				"ScanOptions": "HELIX",
				"SliceThickness": 1,
				"KVP": 120,
				"SpacingBetweenSlices": 1,
				"DataCollectionDiameter": 500,
				"SoftwareVersions": "4.1",
				"ReconstructionDiameter": 377,
				"DistanceSourceToDetector": 1040,
				"DistanceSourceToPatient": 570,
				"GantryDetectorTilt": 0,
				"TableHeight": 150.6,
				"ExposureTime": 500,
				"XRayTubeCurrent": 134,
				"Exposure": 67,
				"FilterType": "IMR",
				"ConvolutionKernel": "IMR1,SharpPlus",
				"PatientPosition": "HFS",
				"AcquisitionType": "SPIRAL",
				"RevolutionTime": 0.5,
				"SingleCollimationWidth": 0.625,
				"TotalCollimationWidth": 80,
				"TableSpeed": 160,
				"TableFeedPerRotation": 128,
				"SpiralPitchFactor": 1,
				"ExposureModulationType": "Z MODULATION",
				"EstimatedDoseSaving": 3,
				"CTDIvol": 4.466666666666667,
				"SeriesNumber": 206,
				"AcquisitionNumber": 1,
				"InstanceNumber": 1,
				"ImagePositionPatient": [
					-202.449,
					-84.1,
					322.28
				],
				"ImageOrientationPatient": [
					1,
					0,
					0,
					0,
					1,
					0
				],
				"SliceLocation": 322.28,
				"SamplesPerPixel": 1,
				"PhotometricInterpretation": "MONOCHROME2",
				"Rows": 512,
				"Columns": 512,
				"PixelSpacing": [
					0.736328125,
					0.736328125
				],
				"BitsAllocated": 16,
				"BitsStored": 12,
				"HighBit": 11,
				"PixelRepresentation": 0,
				"LongitudinalTemporalInformationModified": "MODIFIED",
				"WindowCenter": [
					-600,
					-600
				],
				"WindowWidth": [
					1600,
					1600
				],
				"RescaleIntercept": -1024,
				"RescaleSlope": 1
			}
		}
	},
	"file_id": "6555e05d8e2d23de9e9d4a56",
	"url": "latest.sse.flywheel.io/ohif-viewer/project/65f467743908b97973678a1c/viewer/1.3.6.1.4.1.14519.5.2.1.6655.2359.234717679271014228045088756674/1.3.6.1.4.1.14519.5.2.1.6655.2359.248893347984982444338347575314",
	"zip_member_count": 310,
	"type": "dicom",
	"name": "206.000000-IMR-75314.dicom.zip"
}