{
	"info": {
		"header": {
			"dicom": {
				"FileMetaInformationGroupLength": 206,
				"MediaStorageSOPClassUID": "1.2.840.10008.5.1.4.1.1.7",
				"TransferSyntaxUID": "1.2.840.10008.1.2.1",
				"ImplementationClassUID": "1.3.6.1.4.1.22213.1.143",
				"ImplementationVersionName": "0.5",
				"SourceApplicationEntityTitle": "POSDA",
				"SpecificCharacterSet": "ISO_IR 100",
				"ImageType": [
					"DERIVED",
					"SECONDARY",
					"OTHER",
					"CSA FUSED MPR",
					"",
					"CSAPARALLEL",
					"AXIAL",
					"CT_SOM5 SPI"
				],
				"SOPClassUID": "1.2.840.10008.5.1.4.1.1.7",
				"Modality": "CT",
				"ConversionType": "WSD",
				"Manufacturer": "SIEMENS",
				"ManufacturerModelName": "Biograph64",
				"PatientIdentityRemoved": "YES",
				"DeidentificationMethod": "Per DICOM PS 3.15 AnnexE. Details in 0012,0064",
				"DeidentificationMethodCodeSequence": [
					{
						"CodeMeaning": "Basic Application Confidentiality Profile",
						"CodeValue": "113100",
						"CodingSchemeDesignator": "DCM"
					},
					{
						"CodeMeaning": "Clean Pixel Data Option",
						"CodeValue": "113101",
						"CodingSchemeDesignator": "DCM"
					},
					{
						"CodeMeaning": "Clean Structured Content Option",
						"CodeValue": "113104",
						"CodingSchemeDesignator": "DCM"
					},
					{
						"CodeMeaning": "Clean Descriptors Option",
						"CodeValue": "113105",
						"CodingSchemeDesignator": "DCM"
					},
					{
						"CodeMeaning": "Retain Longitudinal Temporal Information Modified Dates Option",
						"CodeValue": "113107",
						"CodingSchemeDesignator": "DCM"
					},
					{
						"CodeMeaning": "Retain Patient Characteristics Option",
						"CodeValue": "113108",
						"CodingSchemeDesignator": "DCM"
					},
					{
						"CodeMeaning": "Retain Device Identity Option",
						"CodeValue": "113109",
						"CodingSchemeDesignator": "DCM"
					},
					{
						"CodeMeaning": "Retain Safe Private Option",
						"CodeValue": "113111",
						"CodingSchemeDesignator": "DCM"
					}
				],
				"BodyPartExamined": "ABDOMEN",
				"SecondaryCaptureDeviceID": "PETCT",
				"SecondaryCaptureDeviceManufacturer": "SIEMENS",
				"SecondaryCaptureDeviceManufacturerModelName": "Biograph64",
				"SecondaryCaptureDeviceSoftwareVersions": "VG62B",
				"SoftwareVersions": "VG62B",
				"PatientPosition": "HFS",
				"SeriesNumber": 15,
				"AcquisitionNumber": 4,
				"InstanceNumber": 1,
				"PatientOrientation": [
					"L",
					"P"
				],
				"SamplesPerPixel": 3,
				"PhotometricInterpretation": "RGB",
				"PlanarConfiguration": 0,
				"Rows": 512,
				"Columns": 512,
				"BitsAllocated": 8,
				"BitsStored": 8,
				"HighBit": 7,
				"PixelRepresentation": 0,
				"LongitudinalTemporalInformationModified": "MODIFIED"
			}
		}
	},
	"file_id": "6555e05a8e2d23de9e9d4868",
	"url": "latest.sse.flywheel.io/ohif-viewer/project/65f467743908b97973678a1c/viewer/1.3.6.1.4.1.14519.5.2.1.6655.2359.117463624842541865512524634232/1.3.6.1.4.1.14519.5.2.1.6655.2359.139363970275840397723281714080",
	"zip_member_count": 186,
	"type": "dicom",
	"name": "15.000000-Range-CT WB  1.0  B30f-Tra-ALPHA Range-14080.dicom.zip"
}