pid,subject,measurement,age,average score,adjusted score,trial phase,z-score,alignment,fname,acq
Work,topup_test,working_topup,1,66,66,initial,0.34,chaotic neutral,nodif.nii.gz,nodif
Work,CMRR,CMRR,2,66,66,final,0.98,lawful evil,metacopy.json,CMRR_Fail3
Work,patient_02,unzipped_dicom,3,66,66,wizard,0.666,true neutral,,
