{
  "config": {
    "Siemens CSA": false,
    "debug": false
  },
  "inputs": {
    "input-file": {
      "base": "file",
      "hierarchy": {
        "type": "acquisition",
        "id": "60b6b1732bc1490d81f2f0ce"
      },
      "location": {
        "name": "rf_wipsurvey_v42.par",
        "path": "/Users/fabriziopizzagalli/fw/parrec/file-metadata-importer/tests/assets/PARREC/rf_wipsurvey_v42.par"
      },
      "object": {
        "info": {},
        "tags": [],
        "measurements": [],
        "classification": {
          "Custom": []
        },
        "mimetype": "application/zip",
        "type": "parrec",
        "modality": "MR",
        "size": 16485660
      }
    }
  },
  "destination": {
    "type": "acquisition",
    "id": "60b6b1732bc1490d81f2f0ce"
  }
}
