id,existing_subject_label,new_subject_label
60ef29e1304ad08e51986ec4,sub-01,
6151ea69577559af284ec870,sub-02,
615205743d956a115c4ec8cd,sub-03,new-sub-12
615205743d956a115c4ec8ce,sub-04,
615205743d956a115c4ec8cf,sub-05,
615205743d956a115c4ec8d0,sub-06,
61b2417d8b6e8722dcb78f00,sub-07,
61b25583ccf20677b2b68fd4,sub-08,
61b37bae873fb1b11b61bdef,sub-09,
61ba4155c3f98e7480b7e08e,sub-10,
61d4b9e3140dd0e23cca0417,sub-11,
61d8cd84c8c52567a0fb5533,sub-12,
61dc521668722e06deaf3468,sub-13,
620151436d11885a23943b3e,sub-14,new_sub-99
620152b33d3edbffafed3fed,sub-15,
62015e1c6d11885a23943b45,sub-16,
623c8b0ee5814fd16f3f156a,sub-17,
626c68ff9a363185215853cf,sub-18,
626c68ffd0e41bf9369d0928,sub-19,
