existing_acquisition_label,SeriesNumber,session,new_acquisition_label,num_expected_runs,ignore,Comments
diffusion_new_directions,6,109,dwi_acq-sonic,1,,
diffusion_new_directions,7,109,dwi_acq-sonic,1,,"Should throw the info log that there is no specific match, b/c the other example template specified SeriesNumber 6."
dwi_acq-dti6dxb5_dir-PA,,109,,1,,
EPI_delayed_discount,,109,func-bold_task-delayedDiscount_run-01,1,,
EPI_gambling,,109,func-bold_task-gambling_run-02,1,,
EPI_nback_1,12,109,func-bold_task-nback_run-01,1,,
scout,1,109,,,T,
T1_GRE,,109,anat-T1w,1,,
wm,,109,func-bold_task-wm,2,,
wm,32,109,func-bold_task-wm,2,,
