module modernc.org/libc

go 1.20

retract v1.43.0

require (
	github.com/dustin/go-humanize v1.0.1
	github.com/google/uuid v1.6.0
	github.com/mattn/go-isatty v0.0.20
	github.com/ncruces/go-strftime v0.1.9
	golang.org/x/sys v0.18.0
	modernc.org/ccgo/v4 v4.17.9
	modernc.org/fileutil v1.3.0
	modernc.org/mathutil v1.6.0
	modernc.org/memory v1.8.0
)

require (
	github.com/kballard/go-shellquote v0.0.0-20180428030007-95032a82bc51 // indirect
	github.com/remyoudompheng/bigfft v0.0.0-20230129092748-24d4a6f8daec // indirect
	golang.org/x/mod v0.16.0 // indirect
	golang.org/x/tools v0.19.0 // indirect
	lukechampine.com/uint128 v1.2.0 // indirect
	modernc.org/cc/v3 v3.41.0 // indirect
	modernc.org/cc/v4 v4.21.2 // indirect
	modernc.org/ccgo/v3 v3.17.0 // indirect
	modernc.org/gc/v2 v2.4.1 // indirect
	modernc.org/opt v0.1.3 // indirect
	modernc.org/sortutil v1.2.0 // indirect
	modernc.org/strutil v1.2.0 // indirect
	modernc.org/token v1.1.0 // indirect
)
