[gd_resource type="ShaderMaterial" load_steps=2 format=2]

[ext_resource path="res://Shader/palette_R.gdshader" type="Shader" id=1]

[resource]
shader = ExtResource( 1 )
shader_param/numberOfColors = 16
shader_param/C0 = Color( 0, 0, 0, 0 )
shader_param/C1 = Color( 0.121569, 0.121569, 0.121569, 1 )
shader_param/C2 = Color( 0.184314, 0.184314, 0.184314, 1 )
shader_param/C3 = Color( 0.247059, 0.247059, 0.247059, 1 )
shader_param/C4 = Color( 0.309804, 0.309804, 0.309804, 1 )
shader_param/C5 = Color( 0.372549, 0.372549, 0.372549, 1 )
shader_param/C6 = Color( 0.435294, 0.435294, 0.435294, 1 )
shader_param/C7 = Color( 0.498039, 0.498039, 0.498039, 1 )
shader_param/C8 = Color( 0.560784, 0.560784, 0.560784, 1 )
shader_param/C9 = Color( 0.623529, 0.623529, 0.623529, 1 )
shader_param/C10 = Color( 0.686275, 0.686275, 0.686275, 1 )
shader_param/C11 = Color( 0.74902, 0.74902, 0.74902, 1 )
shader_param/C12 = Color( 0.811765, 0.811765, 0.811765, 1 )
shader_param/C13 = Color( 0.87451, 0.87451, 0.87451, 1 )
shader_param/C14 = Color( 0.937255, 0.937255, 0.937255, 1 )
shader_param/C15 = Color( 1, 1, 1, 1 )
