{
  "project_info": {
    "project_number": "665796045554",
    "project_id": "flutter-simple-chat-app-338d6",
    "storage_bucket": "flutter-simple-chat-app-338d6.appspot.com"
  },
  "client": [
    {
      "client_info": {
        "mobilesdk_app_id": "1:665796045554:android:1c56ac630d90da735d7e6b",
        "android_client_info": {
          "package_name": "com.example.flutter_chat_app"
        }
      },
      "oauth_client": [],
      "api_key": [
        {
          "current_key": "AIzaSyBzEMqP7VojxKQOVMu6Zp6zZvaulNJ-Hjo"
        }
      ],
      "services": {
        "appinvite_service": {
          "other_platform_oauth_client": []
        }
      }
    }
  ],
  "configuration_version": "1"
}