module gitlab.com/flownative/localbeach

require (
	cloud.google.com/go v0.47.0 // indirect
	cloud.google.com/go/bigquery v1.1.0 // indirect
	cloud.google.com/go/storage v1.1.1 // indirect
	github.com/alecthomas/units v0.0.0-20190924025748-f65c72e2690d // indirect
	github.com/coreos/bbolt v1.3.3 // indirect
	github.com/coreos/etcd v3.3.17+incompatible // indirect
	github.com/coreos/go-semver v0.3.0 // indirect
	github.com/coreos/go-systemd v0.0.0-20190719114852-fd7a80b32e1f // indirect
	github.com/creack/pty v1.1.9 // indirect
	github.com/docker/distribution v2.7.1+incompatible // indirect
	github.com/docker/docker v1.13.1
	github.com/docker/go-connections v0.4.0 // indirect
	github.com/docker/go-units v0.4.0 // indirect
	github.com/gogo/protobuf v1.3.1 // indirect
	github.com/golang/groupcache v0.0.0-20191002201903-404acd9df4cc // indirect
	github.com/google/go-cmp v0.3.1 // indirect
	github.com/google/pprof v0.0.0-20190930153522-6ce02741cba3 // indirect
	github.com/gorilla/websocket v1.4.1 // indirect
	github.com/grpc-ecosystem/go-grpc-middleware v1.1.0 // indirect
	github.com/grpc-ecosystem/grpc-gateway v1.11.3 // indirect
	github.com/hashicorp/golang-lru v0.5.3 // indirect
	github.com/jstemmer/go-junit-report v0.9.1 // indirect
	github.com/julienschmidt/httprouter v1.3.0 // indirect
	github.com/konsorten/go-windows-terminal-sequences v1.0.2 // indirect
	github.com/kr/pty v1.1.8 // indirect
	github.com/magiconair/properties v1.8.1 // indirect
	github.com/modern-go/concurrent v0.0.0-20180306012644-bacd9c7ef1dd // indirect
	github.com/modern-go/reflect2 v1.0.1 // indirect
	github.com/mwitkow/go-conntrack v0.0.0-20190716064945-2f068394615f // indirect
	github.com/opencontainers/go-digest v1.0.0-rc1 // indirect
	github.com/pelletier/go-toml v1.5.0 // indirect
	github.com/prometheus/client_golang v1.2.0 // indirect
	github.com/rogpeppe/fastuuid v1.2.0 // indirect
	github.com/rogpeppe/go-internal v1.5.0 // indirect
	github.com/russross/blackfriday v2.0.0+incompatible // indirect
	github.com/sirupsen/logrus v1.4.2
	github.com/spf13/afero v1.2.2 // indirect
	github.com/spf13/cobra v0.0.5
	github.com/spf13/jwalterweatherman v1.1.0 // indirect
	github.com/spf13/pflag v1.0.5 // indirect
	github.com/spf13/viper v1.4.0 // indirect
	github.com/stretchr/objx v0.2.0 // indirect
	github.com/ugorji/go v1.1.7 // indirect
	go.etcd.io/bbolt v1.3.3 // indirect
	go.opencensus.io v0.22.1 // indirect
	go.uber.org/multierr v1.2.0 // indirect
	golang.org/x/crypto v0.0.0-20191011191535-87dc89f01550 // indirect
	golang.org/x/exp v0.0.0-20191014171548-69215a2ee97e // indirect
	golang.org/x/image v0.0.0-20191009234506-e7c1f5e7dbb8 // indirect
	golang.org/x/mobile v0.0.0-20191002175909-6d0d39b2ca82 // indirect
	golang.org/x/net v0.0.0-20191014212845-da9a3fd4c582
	golang.org/x/sync v0.0.0-20190911185100-cd5d95a43a6e // indirect
	golang.org/x/time v0.0.0-20190921001708-c4c64cad1fd0 // indirect
	golang.org/x/tools v0.0.0-20191015211201-9c6d90b5a7d0 // indirect
	golang.org/x/xerrors v0.0.0-20191011141410-1b5146add898 // indirect
	google.golang.org/appengine v1.6.5 // indirect
	google.golang.org/grpc v1.24.0 // indirect
	gopkg.in/check.v1 v1.0.0-20190902080502-41f04d3bba15 // indirect
)
