<?xml version="1.0" encoding="UTF-8" standalone="no"?>
<!-- Created with Inkscape (http://www.inkscape.org/) -->

<svg
   xmlns:dc="http://purl.org/dc/elements/1.1/"
   xmlns:cc="http://creativecommons.org/ns#"
   xmlns:rdf="http://www.w3.org/1999/02/22-rdf-syntax-ns#"
   xmlns:svg="http://www.w3.org/2000/svg"
   xmlns="http://www.w3.org/2000/svg"
   xmlns:sodipodi="http://sodipodi.sourceforge.net/DTD/sodipodi-0.dtd"
   xmlns:inkscape="http://www.inkscape.org/namespaces/inkscape"
   width="100mm"
   height="100mm"
   viewBox="0 0 100 100"
   version="1.1"
   id="svg4673"
   inkscape:version="0.92.4 (5da689c313, 2019-01-14)"
   sodipodi:docname="icon.svg">
  <defs
     id="defs4667" />
  <sodipodi:namedview
     id="base"
     pagecolor="#ffffff"
     bordercolor="#666666"
     borderopacity="1.0"
     inkscape:pageopacity="0.0"
     inkscape:pageshadow="2"
     inkscape:zoom="1.000000004221073"
     inkscape:cx="189.5255806372597"
     inkscape:cy="235.370147986932"
     inkscape:document-units="mm"
     inkscape:current-layer="layer1"
     showgrid="false"
     showguides="true"
     inkscape:guide-bbox="true"
     inkscape:snap-center="true"
     inkscape:snap-object-midpoints="true"
     inkscape:window-width="960"
     inkscape:window-height="1001"
     inkscape:window-x="-9"
     inkscape:window-y="-9"
     inkscape:window-maximized="1">
    <sodipodi:guide
       position="49.99999961853029,49.99999961853029"
       orientation="0,1"
       id="guide5260"
       inkscape:locked="false"
       inkscape:label=""
       inkscape:color="rgb(0,0,255)" />
  </sodipodi:namedview>
  <metadata
     id="metadata4670">
    <rdf:RDF>
      <cc:Work
         rdf:about="">
        <dc:format>image/svg+xml</dc:format>
        <dc:type
           rdf:resource="http://purl.org/dc/dcmitype/StillImage" />
        <dc:title></dc:title>
        <cc:license
           rdf:resource="http://creativecommons.org/licenses/by-sa/4.0/" />
        <dc:contributor>
          <cc:Agent>
            <dc:title>https://openmoji.org/library/#search=bookmark&amp;emoji=1F516</dc:title>
          </cc:Agent>
        </dc:contributor>
      </cc:Work>
      <cc:License
         rdf:about="http://creativecommons.org/licenses/by-sa/4.0/">
        <cc:permits
           rdf:resource="http://creativecommons.org/ns#Reproduction" />
        <cc:permits
           rdf:resource="http://creativecommons.org/ns#Distribution" />
        <cc:requires
           rdf:resource="http://creativecommons.org/ns#Notice" />
        <cc:requires
           rdf:resource="http://creativecommons.org/ns#Attribution" />
        <cc:permits
           rdf:resource="http://creativecommons.org/ns#DerivativeWorks" />
        <cc:requires
           rdf:resource="http://creativecommons.org/ns#ShareAlike" />
      </cc:License>
    </rdf:RDF>
  </metadata>
  <g
     inkscape:label="Layer 1"
     inkscape:groupmode="layer"
     id="layer1"
     transform="translate(0,-197.0000000000001)">
    <g
       id="g892"
       transform="matrix(2.125780800612969,0,0,2.125780800612968,-27.59099922237337,175.830837053256)">
      <g
         id="color">
        <polygon
           id="polygon863"
           points="46.5,10.9583 46.5,56 36.5,44.8488 26.5,56 26.5,10.9583 "
           stroke-miterlimit="10"
           style="fill:#ea5a47;stroke:none;stroke-width:2;stroke-linecap:round;stroke-linejoin:round;stroke-miterlimit:10" />
        <polygon
           id="polygon865"
           points="46.387,12.0303 41.8638,12.0303 41.8638,49.8841 46.387,54.928 "
           style="fill:#d22f27;stroke:none" />
      </g>
      <g
         id="hair" />
      <g
         id="skin" />
      <g
         id="skin-shadow" />
      <g
         id="line">
        <polygon
           id="polygon871"
           points="46.5,10.9583 46.5,56 36.5,44.8488 26.5,56 26.5,10.9583 "
           stroke-miterlimit="10"
           style="fill:none;stroke:#000000;stroke-width:2;stroke-linecap:round;stroke-linejoin:round;stroke-miterlimit:10" />
        <polygon
           id="polygon873"
           points="46.5,10.9583 46.5,56 36.5,44.8488 26.5,56 26.5,10.9583 "
           stroke-miterlimit="10"
           style="fill:none;stroke:#000000;stroke-width:2;stroke-linecap:round;stroke-linejoin:round;stroke-miterlimit:10" />
      </g>
    </g>
    <g
       aria-label="…"
       style="font-style:normal;font-weight:normal;font-size:10.5833330154px;line-height:1.25;font-family:sans-serif;letter-spacing:0px;word-spacing:0px;fill:#000000;fill-opacity:1;stroke:none;stroke-width:0.2645833194"
       id="text5278"
       transform="matrix(18.29034185596722,0,0,18.29034185596722,-734.858240069333,-4103.775903859898)">
      <path
         d="m 40.17739230114968,238.3947906494141 v -1.0438639009372 h 1.01802568556741 v 1.0438639009372 z m 2.28409823868424,0 v -1.0438639009372 h 1.0180256855674 v 1.0438639009372 z m 2.16524244798347,0 v -1.0438639009372 h 1.01802568556743 v 1.0438639009372 z"
         style="font-style:normal;font-variant:normal;font-weight:normal;font-stretch:normal;font-family:'Roboto Slab';-inkscape-font-specification:'Roboto Slab';stroke-width:0.2645833194"
         id="path5280"
         inkscape:connector-curvature="0" />
    </g>
  </g>
</svg>
