%YAML 1.1
%TAG !u! tag:unity3d.com,2011:
--- !u!114 &11400000
MonoBehaviour:
  m_ObjectHideFlags: 0
  m_CorrespondingSourceObject: {fileID: 0}
  m_PrefabInstance: {fileID: 0}
  m_PrefabAsset: {fileID: 0}
  m_GameObject: {fileID: 0}
  m_Enabled: 1
  m_EditorHideFlags: 0
  m_Script: {fileID: 11500000, guid: abfbecea1f703e64f8968fc618b30e21, type: 3}
  m_Name: GunScriptableObject-Pistol92-White
  m_EditorClassIdentifier: 
  Gun: {fileID: 3945439267341455232, guid: d203906c532c7414bb2292dc2ec075b5, type: 3}
  GunImage: {fileID: 21300000, guid: 6ed25a7a56aac354786c65257458d786, type: 3}
  Name: Pistol 92 White
  GunType: 1
  Damage: 35
  ClipSize: 12
  Ammo: 36
  ReloadTime: 2.2
  RateOfFire: 0.35
