<?xml version="1.0" encoding="utf-8"?>
<!-- Generator: Adobe Illustrator 26.0.1, SVG Export Plug-In . SVG Version: 6.00 Build 0)  -->
<svg version="1.1" id="Calque_1" xmlns="http://www.w3.org/2000/svg" xmlns:xlink="http://www.w3.org/1999/xlink" x="0px" y="0px"
	 viewBox="0 0 50 50" style="enable-background:new 0 0 50 50;" xml:space="preserve">
<style type="text/css">
	.st0{fill:#FFFFFF;}
</style>
<g>
	<polygon class="st0" points="15.45,27.73 43,16 5,23.55 	"/>
	<polygon class="st0" points="43,16 42.57,16.23 42.57,16.23 19,27 16.52,28.24 24.58,31.72 24.58,31.72 30.09,34 	"/>
	<polygon class="st0" points="15,29.82 15,36.78 21.67,32.34 15,29 	"/>
</g>
</svg>
