<?xml version="1.0" encoding="utf-8"?>
<!-- Generator: Adobe Illustrator 26.0.1, SVG Export Plug-In . SVG Version: 6.00 Build 0)  -->
<svg version="1.1" id="Calque_1" xmlns="http://www.w3.org/2000/svg" xmlns:xlink="http://www.w3.org/1999/xlink" x="0px" y="0px"
	 viewBox="0 0 50 50" style="enable-background:new 0 0 50 50;" xml:space="preserve">
<style type="text/css">
	.st0{fill:#FFFFFF;}
</style>
<g>
	<circle class="st0" cx="25.34" cy="18.38" r="6.62"/>
</g>
<g>
	<path class="st0" d="M39,38.24H11v-0.97c0-6.16,3.31-11.16,11.16-11.16h5.68C36.37,26.1,39,31.1,39,37.26V38.24z"/>
</g>
</svg>
