[
  {
    "roleKey": "user",
    "resources": [
      {
        "resourceKey": "examples",
        "actions": [
          "read",
          "create",
          "toto"
        ]
      }
    ]
  },
  {
    "roleKey": "bot",
    "resources": [
      {
        "resourceKey": "examples",
        "actions": [
          "read",
          "create",
          "update",
          "delete"
        ]
      }
    ]
  }
]
