%YAML 1.1
%TAG !u! tag:unity3d.com,2011:
--- !u!114 &11400000
MonoBehaviour:
  m_ObjectHideFlags: 0
  m_CorrespondingSourceObject: {fileID: 0}
  m_PrefabInstance: {fileID: 0}
  m_PrefabAsset: {fileID: 0}
  m_GameObject: {fileID: 0}
  m_Enabled: 1
  m_EditorHideFlags: 0
  m_Script: {fileID: 11500000, guid: 0b57ee0147eccf34b8d9ac41a566c1fe, type: 3}
  m_Name: Cruel Sword
  m_EditorClassIdentifier: 
  name: Cruel Sword
  icon: {fileID: 21300000, guid: 317e247c8e30f2b458c0446bb8779ccc, type: 3}
  isDefaultItem: 0
  equipSlot: 8
  equipType: 2
  mesh: {fileID: 4118194806407696442, guid: 12a8b84f2d9abd64c8ffe3e97dfae558, type: 3}
  damageModifier: 30
  speedModifier: 1
  armorModifier: 0
  vitalityModifier: 5
  staminaModifier: 8
  strengthModifier: 5
  agilityModifier: 20
  dextertyModifier: 2
  intelligenceModifier: 0
  identified: 1
