%YAML 1.1
%TAG !u! tag:unity3d.com,2011:
--- !u!1 &2336096480880414337
GameObject:
  m_ObjectHideFlags: 0
  m_CorrespondingSourceObject: {fileID: 0}
  m_PrefabInstance: {fileID: 0}
  m_PrefabAsset: {fileID: 0}
  serializedVersion: 6
  m_Component:
  - component: {fileID: 2336096480880414362}
  - component: {fileID: 2336096480880414363}
  - component: {fileID: 2336096480880414342}
  m_Layer: 0
  m_Name: Leather Chest Pickup
  m_TagString: Untagged
  m_Icon: {fileID: 2800000, guid: c8bfad0e5e2e8bb4ba5bc5ffd872d650, type: 3}
  m_NavMeshLayer: 0
  m_StaticEditorFlags: 0
  m_IsActive: 1
--- !u!4 &2336096480880414362
Transform:
  m_ObjectHideFlags: 0
  m_CorrespondingSourceObject: {fileID: 0}
  m_PrefabInstance: {fileID: 0}
  m_PrefabAsset: {fileID: 0}
  m_GameObject: {fileID: 2336096480880414337}
  m_LocalRotation: {x: 0, y: 0, z: 0, w: 1}
  m_LocalPosition: {x: 0, y: 0, z: 0}
  m_LocalScale: {x: 1, y: 1, z: 1}
  m_Children:
  - {fileID: 6132772644522132749}
  m_Father: {fileID: 0}
  m_RootOrder: 0
  m_LocalEulerAnglesHint: {x: 0, y: 0, z: 0}
--- !u!114 &2336096480880414363
MonoBehaviour:
  m_ObjectHideFlags: 0
  m_CorrespondingSourceObject: {fileID: 0}
  m_PrefabInstance: {fileID: 0}
  m_PrefabAsset: {fileID: 0}
  m_GameObject: {fileID: 2336096480880414337}
  m_Enabled: 1
  m_EditorHideFlags: 0
  m_Script: {fileID: 11500000, guid: 1ea3a115a7dd8e543af03bce0f019a19, type: 3}
  m_Name: 
  m_EditorClassIdentifier: 
  radius: 0.5
  ActionText: {fileID: 6813602178025455710, guid: b031fedd9114f434e97ba9e99b4ef35e,
    type: 3}
  InteractionAvailable: 0
  item: {fileID: 11400000, guid: 763764eb816071b4bb25d6ec253a73b4, type: 2}
  actionKey: e
--- !u!135 &2336096480880414342
SphereCollider:
  m_ObjectHideFlags: 0
  m_CorrespondingSourceObject: {fileID: 0}
  m_PrefabInstance: {fileID: 0}
  m_PrefabAsset: {fileID: 0}
  m_GameObject: {fileID: 2336096480880414337}
  m_Material: {fileID: 0}
  m_IsTrigger: 1
  m_Enabled: 1
  serializedVersion: 2
  m_Radius: 0.5
  m_Center: {x: 0, y: 0, z: 0}
--- !u!1001 &1661087177486074633
PrefabInstance:
  m_ObjectHideFlags: 0
  serializedVersion: 2
  m_Modification:
    m_TransformParent: {fileID: 2336096480880414362}
    m_Modifications:
    - target: {fileID: 3546997675214488777, guid: 0a4f66f958bce534982d96d018e6e696,
        type: 3}
      propertyPath: m_Name
      value: Leather_Chest
      objectReference: {fileID: 0}
    - target: {fileID: 4762171530047784452, guid: 0a4f66f958bce534982d96d018e6e696,
        type: 3}
      propertyPath: m_LocalPosition.x
      value: -0
      objectReference: {fileID: 0}
    - target: {fileID: 4762171530047784452, guid: 0a4f66f958bce534982d96d018e6e696,
        type: 3}
      propertyPath: m_LocalPosition.y
      value: 0
      objectReference: {fileID: 0}
    - target: {fileID: 4762171530047784452, guid: 0a4f66f958bce534982d96d018e6e696,
        type: 3}
      propertyPath: m_LocalPosition.z
      value: -1.325
      objectReference: {fileID: 0}
    - target: {fileID: 4762171530047784452, guid: 0a4f66f958bce534982d96d018e6e696,
        type: 3}
      propertyPath: m_LocalRotation.x
      value: 0
      objectReference: {fileID: 0}
    - target: {fileID: 4762171530047784452, guid: 0a4f66f958bce534982d96d018e6e696,
        type: 3}
      propertyPath: m_LocalRotation.y
      value: -0
      objectReference: {fileID: 0}
    - target: {fileID: 4762171530047784452, guid: 0a4f66f958bce534982d96d018e6e696,
        type: 3}
      propertyPath: m_LocalRotation.z
      value: -0
      objectReference: {fileID: 0}
    - target: {fileID: 4762171530047784452, guid: 0a4f66f958bce534982d96d018e6e696,
        type: 3}
      propertyPath: m_LocalRotation.w
      value: 1
      objectReference: {fileID: 0}
    - target: {fileID: 4762171530047784452, guid: 0a4f66f958bce534982d96d018e6e696,
        type: 3}
      propertyPath: m_RootOrder
      value: 0
      objectReference: {fileID: 0}
    - target: {fileID: 4762171530047784452, guid: 0a4f66f958bce534982d96d018e6e696,
        type: 3}
      propertyPath: m_LocalEulerAnglesHint.x
      value: 0
      objectReference: {fileID: 0}
    - target: {fileID: 4762171530047784452, guid: 0a4f66f958bce534982d96d018e6e696,
        type: 3}
      propertyPath: m_LocalEulerAnglesHint.y
      value: 0
      objectReference: {fileID: 0}
    - target: {fileID: 4762171530047784452, guid: 0a4f66f958bce534982d96d018e6e696,
        type: 3}
      propertyPath: m_LocalEulerAnglesHint.z
      value: 0
      objectReference: {fileID: 0}
    - target: {fileID: 4762171530047784452, guid: 0a4f66f958bce534982d96d018e6e696,
        type: 3}
      propertyPath: m_LocalScale.y
      value: 0.1
      objectReference: {fileID: 0}
    m_RemovedComponents: []
  m_SourcePrefab: {fileID: 100100000, guid: 0a4f66f958bce534982d96d018e6e696, type: 3}
--- !u!4 &6132772644522132749 stripped
Transform:
  m_CorrespondingSourceObject: {fileID: 4762171530047784452, guid: 0a4f66f958bce534982d96d018e6e696,
    type: 3}
  m_PrefabInstance: {fileID: 1661087177486074633}
  m_PrefabAsset: {fileID: 0}
