%YAML 1.1
%TAG !u! tag:unity3d.com,2011:
--- !u!1 &7846172333870092808
GameObject:
  m_ObjectHideFlags: 0
  m_CorrespondingSourceObject: {fileID: 0}
  m_PrefabInstance: {fileID: 0}
  m_PrefabAsset: {fileID: 0}
  serializedVersion: 6
  m_Component:
  - component: {fileID: 7846172333870092819}
  - component: {fileID: 7846172333870092818}
  - component: {fileID: 7846172333870092815}
  m_Layer: 0
  m_Name: Scepter pickup
  m_TagString: Untagged
  m_Icon: {fileID: 0}
  m_NavMeshLayer: 0
  m_StaticEditorFlags: 0
  m_IsActive: 1
--- !u!4 &7846172333870092819
Transform:
  m_ObjectHideFlags: 0
  m_CorrespondingSourceObject: {fileID: 0}
  m_PrefabInstance: {fileID: 0}
  m_PrefabAsset: {fileID: 0}
  m_GameObject: {fileID: 7846172333870092808}
  m_LocalRotation: {x: -0, y: -0, z: -0, w: 1}
  m_LocalPosition: {x: 0, y: 0, z: 0}
  m_LocalScale: {x: 1, y: 1, z: 1}
  m_Children:
  - {fileID: 2213190997594856017}
  m_Father: {fileID: 0}
  m_RootOrder: 0
  m_LocalEulerAnglesHint: {x: 0, y: 0, z: 0}
--- !u!114 &7846172333870092818
MonoBehaviour:
  m_ObjectHideFlags: 0
  m_CorrespondingSourceObject: {fileID: 0}
  m_PrefabInstance: {fileID: 0}
  m_PrefabAsset: {fileID: 0}
  m_GameObject: {fileID: 7846172333870092808}
  m_Enabled: 1
  m_EditorHideFlags: 0
  m_Script: {fileID: 11500000, guid: 1ea3a115a7dd8e543af03bce0f019a19, type: 3}
  m_Name: 
  m_EditorClassIdentifier: 
  radius: 0.5
  ActionText: {fileID: 6813602178025455710, guid: b031fedd9114f434e97ba9e99b4ef35e,
    type: 3}
  InteractionAvailable: 0
  item: {fileID: 11400000, guid: c0a60fa868f8e2f47928776c770bfd92, type: 2}
  actionKey: e
--- !u!135 &7846172333870092815
SphereCollider:
  m_ObjectHideFlags: 0
  m_CorrespondingSourceObject: {fileID: 0}
  m_PrefabInstance: {fileID: 0}
  m_PrefabAsset: {fileID: 0}
  m_GameObject: {fileID: 7846172333870092808}
  m_Material: {fileID: 0}
  m_IsTrigger: 1
  m_Enabled: 1
  serializedVersion: 2
  m_Radius: 0.5
  m_Center: {x: 0, y: 0, z: 0}
--- !u!1001 &4600653504460033198
PrefabInstance:
  m_ObjectHideFlags: 0
  serializedVersion: 2
  m_Modification:
    m_TransformParent: {fileID: 7846172333870092819}
    m_Modifications:
    - target: {fileID: 286657348450643618, guid: 5af78016175493746a5acb82fcd484c4,
        type: 3}
      propertyPath: m_Name
      value: Scepter Preview
      objectReference: {fileID: 0}
    - target: {fileID: 2408889792285955839, guid: 5af78016175493746a5acb82fcd484c4,
        type: 3}
      propertyPath: m_LocalPosition.x
      value: 0
      objectReference: {fileID: 0}
    - target: {fileID: 2408889792285955839, guid: 5af78016175493746a5acb82fcd484c4,
        type: 3}
      propertyPath: m_LocalPosition.y
      value: 0
      objectReference: {fileID: 0}
    - target: {fileID: 2408889792285955839, guid: 5af78016175493746a5acb82fcd484c4,
        type: 3}
      propertyPath: m_LocalPosition.z
      value: 0
      objectReference: {fileID: 0}
    - target: {fileID: 2408889792285955839, guid: 5af78016175493746a5acb82fcd484c4,
        type: 3}
      propertyPath: m_LocalRotation.x
      value: 0.0000000074505744
      objectReference: {fileID: 0}
    - target: {fileID: 2408889792285955839, guid: 5af78016175493746a5acb82fcd484c4,
        type: 3}
      propertyPath: m_LocalRotation.y
      value: -0.000000022351736
      objectReference: {fileID: 0}
    - target: {fileID: 2408889792285955839, guid: 5af78016175493746a5acb82fcd484c4,
        type: 3}
      propertyPath: m_LocalRotation.z
      value: -3.105959e-15
      objectReference: {fileID: 0}
    - target: {fileID: 2408889792285955839, guid: 5af78016175493746a5acb82fcd484c4,
        type: 3}
      propertyPath: m_LocalRotation.w
      value: 1
      objectReference: {fileID: 0}
    - target: {fileID: 2408889792285955839, guid: 5af78016175493746a5acb82fcd484c4,
        type: 3}
      propertyPath: m_RootOrder
      value: 0
      objectReference: {fileID: 0}
    - target: {fileID: 2408889792285955839, guid: 5af78016175493746a5acb82fcd484c4,
        type: 3}
      propertyPath: m_LocalEulerAnglesHint.x
      value: 0
      objectReference: {fileID: 0}
    - target: {fileID: 2408889792285955839, guid: 5af78016175493746a5acb82fcd484c4,
        type: 3}
      propertyPath: m_LocalEulerAnglesHint.y
      value: 0
      objectReference: {fileID: 0}
    - target: {fileID: 2408889792285955839, guid: 5af78016175493746a5acb82fcd484c4,
        type: 3}
      propertyPath: m_LocalEulerAnglesHint.z
      value: 0
      objectReference: {fileID: 0}
    m_RemovedComponents: []
  m_SourcePrefab: {fileID: 100100000, guid: 5af78016175493746a5acb82fcd484c4, type: 3}
--- !u!4 &2213190997594856017 stripped
Transform:
  m_CorrespondingSourceObject: {fileID: 2408889792285955839, guid: 5af78016175493746a5acb82fcd484c4,
    type: 3}
  m_PrefabInstance: {fileID: 4600653504460033198}
  m_PrefabAsset: {fileID: 0}
