%YAML 1.1
%TAG !u! tag:unity3d.com,2011:
--- !u!114 &11400000
MonoBehaviour:
  m_ObjectHideFlags: 0
  m_CorrespondingSourceObject: {fileID: 0}
  m_PrefabInstance: {fileID: 0}
  m_PrefabAsset: {fileID: 0}
  m_GameObject: {fileID: 0}
  m_Enabled: 1
  m_EditorHideFlags: 0
  m_Script: {fileID: 11500000, guid: 0b57ee0147eccf34b8d9ac41a566c1fe, type: 3}
  m_Name: Hobo Pants
  m_EditorClassIdentifier: 
  name: Hobo Pants
  icon: {fileID: 21300000, guid: 7b20701dc9c4464448b8036c78c74711, type: 3}
  isDefaultItem: 1
  equipSlot: 7
  equipType: 0
  mesh: {fileID: 1385164747993889987, guid: adfdeba0d8004f14b8d24f00d7a3b0e6, type: 3}
  damageModifier: 0
  armorModifier: 1
  vitalityModifier: 0
  staminaModifier: 0
  strengthModifier: 0
  agilityModifier: 0
  dextertyModifier: 0
  intelligenceModifier: 0
  identified: 0
