<svg width="160" height="160" viewBox="0 0 160 160" fill="none" xmlns="http://www.w3.org/2000/svg">
<g clip-path="url(#clip0)">
<path d="M80.7688 135.195C80.3689 135.676 79.6311 135.676 79.2312 135.195L12.0819 54.4753C11.5399 53.8238 12.0032 52.8358 12.8506 52.8358L147.149 52.8358C147.997 52.8358 148.46 53.8239 147.918 54.4753L80.7688 135.195Z" fill="#632B33"/>
<ellipse cx="80" cy="65.6717" rx="42.1053" ry="47.7612" fill="#FFF6E6"/>
<path d="M131.278 57.8064L104.869 136.953L66.4124 99.6124L131.278 57.8064Z" fill="#632B33" fill-opacity="0.12"/>
<path d="M73.9957 99.3503L14.0117 53.6002C13.1988 52.9802 12.0893 53.8354 12.482 54.7793L46.0597 135.504C46.2148 135.876 46.5791 136.119 46.983 136.119H113.544C113.947 136.119 114.312 135.876 114.467 135.504L148.056 54.7521C148.448 53.8101 147.343 52.9551 146.529 53.5705L86.0068 99.3498C85.8646 99.4574 85.7537 99.6011 85.6857 99.766L80.9245 111.306C80.5842 112.13 79.416 112.13 79.0757 111.306L74.3137 99.764C74.2462 99.6004 74.1365 99.4576 73.9957 99.3503Z" fill="#581616" stroke="#581616"/>
<rect x="52.6316" y="59.7015" width="15.7895" height="2.38806" rx="1" fill="#632B33"/>
<rect x="91.5789" y="59.7015" width="15.7895" height="2.38806" rx="1" fill="#632B33"/>
<rect x="78.9473" y="70.4478" width="2.10526" height="11.9403" rx="1.05263" fill="#EFBFB8"/>
<path d="M133.184 38.8059C133.184 39.5167 132.878 40.2493 132.217 41.0031C131.554 41.7601 130.553 42.5142 129.224 43.2483C126.565 44.7163 122.685 46.0544 117.847 47.1843C108.179 49.442 94.7978 50.8432 79.9999 50.8432C65.202 50.8432 51.8209 49.442 42.1531 47.1843C37.3152 46.0544 33.4349 44.7163 30.7761 43.2483C29.4466 42.5142 28.4457 41.7601 27.7824 41.0031C27.1219 40.2493 26.8157 39.5167 26.8157 38.8059C26.8157 38.0951 27.1219 37.3625 27.7824 36.6087C28.4457 35.8517 29.4466 35.0977 30.7761 34.3636C33.4349 32.8955 37.3152 31.5574 42.1531 30.4276C51.8209 28.1698 65.202 26.7686 79.9999 26.7686C94.7978 26.7686 108.179 28.1698 117.847 30.4276C122.685 31.5574 126.565 32.8955 129.224 34.3636C130.553 35.0977 131.554 35.8517 132.217 36.6087C132.878 37.3625 133.184 38.0951 133.184 38.8059Z" fill="#581616" stroke="#581616"/>
<path d="M108.974 37.0149C108.974 37.7113 108.379 38.5251 106.908 39.3701C105.476 40.1934 103.369 40.9517 100.723 41.5949C95.4381 42.8795 88.1112 43.6791 80 43.6791C71.8889 43.6791 64.562 42.8795 59.2771 41.5949C56.6308 40.9517 54.5244 40.1934 53.0917 39.3701C51.6214 38.5251 51.0264 37.7113 51.0264 37.0149C51.0264 36.3186 51.6214 35.5048 53.0917 34.6598C54.5244 33.8365 56.6308 33.0782 59.2771 32.435C64.562 31.1504 71.8889 30.3508 80 30.3508C88.1112 30.3508 95.4381 31.1504 100.723 32.435C103.369 33.0782 105.476 33.8365 106.908 34.6598C108.379 35.5048 108.974 36.3186 108.974 37.0149Z" fill="#581616" stroke="#581616"/>
<path d="M51.0264 7.66418H108.974V36.0149C108.974 36.2911 108.75 36.5149 108.474 36.5149H51.5264C51.2502 36.5149 51.0264 36.2911 51.0264 36.0149V7.66418Z" fill="#581616" stroke="#581616"/>
<path d="M108.974 7.16418C108.974 7.8605 108.379 8.67434 106.908 9.51929C105.476 10.3426 103.369 11.1009 100.723 11.7442C95.4381 13.0288 88.1112 13.8284 80 13.8284C71.8889 13.8284 64.562 13.0288 59.2771 11.7442C56.6308 11.1009 54.5244 10.3426 53.0917 9.51929C51.6214 8.67434 51.0264 7.8605 51.0264 7.16418C51.0264 6.46786 51.6214 5.65402 53.0917 4.80907C54.5244 3.98572 56.6308 3.22744 59.2771 2.58419C64.562 1.2996 71.8889 0.5 80 0.5C88.1112 0.5 95.4381 1.2996 100.723 2.58419C103.369 3.22744 105.476 3.98572 106.908 4.80907C108.379 5.65402 108.974 6.46786 108.974 7.16418Z" fill="#581616" stroke="#581616"/>
<rect x="51.5789" y="35.8209" width="56.8421" height="1.19403" fill="#581616"/>
</g>
<defs>
<clipPath id="clip0">
<rect width="160" height="160" fill="white"/>
</clipPath>
</defs>
</svg>
