<svg width="360" height="718" viewBox="0 0 360 718" fill="none" xmlns="http://www.w3.org/2000/svg">
<path d="M236.108 265.987C239.289 254.778 234.783 238.325 232.133 231.499L118.337 208.328C114.859 211.561 115.952 231.715 108.398 239.043C98.9568 248.204 92 271.393 91.9999 305.324C91.9999 340.35 107.902 372.682 121.815 377.532C132.947 381.412 140.036 371.245 142.189 365.677C137.717 352.385 131.456 323.214 142.189 312.868C155.606 299.935 232.133 279.997 236.108 265.987Z" fill="#E39600"/>
<ellipse cx="181.011" cy="175.011" rx="77.0765" ry="89.0109" fill="#E39600"/>
<ellipse cx="181.011" cy="139.705" rx="54.2022" ry="26.8525" fill="#E39600"/>
<path d="M103 285C103 277.268 109.268 271 117 271V422H103V285Z" fill="#3B6CB5"/>
<path d="M258 286C258 277.716 251.284 271 243 271V422H258V286Z" fill="#3B6CB5"/>
<rect x="114.874" y="433.093" width="63.6503" height="161.115" fill="#404C6A"/>
<rect x="180.514" y="433.093" width="64.6448" height="161.115" fill="#404C6A"/>
<path d="M114.874 270.984H245.158V433.093H114.874V270.984Z" fill="#3B6CB5"/>
<rect x="125.191" y="118.183" width="109.72" height="157.567" rx="54.8599" fill="#F7C298"/>
<rect x="177.988" y="194.079" width="3.29984" height="16.4992" rx="1.64992" fill="#DCAF8B"/>
<circle cx="152.828" cy="181.292" r="8.812" stroke="#343434" stroke-width="3"/>
<rect x="142.515" y="181.705" width="20.624" height="9.89952" fill="#F7C298"/>
<circle cx="207.275" cy="181.292" r="8.812" stroke="#343434" stroke-width="3"/>
<rect x="196.963" y="181.705" width="20.624" height="9.89952" fill="#F7C298"/>
<rect x="107.913" y="375.41" width="145.202" height="93.4863" rx="46.7432" fill="#3B6CB5"/>
<path d="M184.777 293.861C182.826 297.045 178.201 297.045 176.25 293.861L162.784 271.883C160.743 268.551 163.14 264.271 167.047 264.271L193.98 264.271C197.887 264.271 200.285 268.551 198.243 271.883L184.777 293.861Z" fill="#F7C298"/>
<circle cx="108.907" cy="422.153" r="11.9344" fill="#F7C298"/>
<circle r="11.9344" transform="matrix(-1 0 0 1 251.126 422.153)" fill="#F7C298"/>
<path d="M93.9891 622.219C93.9891 605.65 107.421 592.219 123.989 592.219H178.525V632H93.9891V622.219Z" fill="white"/>
<path d="M265.049 622.219C265.049 605.65 251.618 592.219 235.049 592.219H180.514V632H265.049V622.219Z" fill="white"/>
<rect x="193.443" y="519.618" width="38.7869" height="5.96721" rx="2.98361" fill="#F7C298"/>
<rect x="127.803" y="519.618" width="38.7869" height="5.96721" rx="2.98361" fill="#F7C298"/>
<path d="M130.856 149.639C131.891 131.901 146.603 117.836 164.601 117.836H195.432C213.429 117.836 228.142 131.901 229.177 149.639H130.856Z" fill="#404C6A" stroke="#45547B" stroke-width="4"/>
<circle cx="207" cy="178" r="16.5" fill="#343434" stroke="#513827"/>
<circle cx="153" cy="178" r="16.5" fill="#343434" stroke="#513827"/>
<path d="M169 176.5C169 176.5 175.198 170.91 180 171C184.628 171.087 190.5 176.5 190.5 176.5" stroke="#513827"/>
<rect x="141.701" y="168.224" width="6.03348" height="29.2556" transform="rotate(-38.4807 141.701 168.224)" fill="white"/>
<rect x="139" y="170.054" width="1.69328" height="29.2556" transform="rotate(-38.4807 139 170.054)" fill="white"/>
<rect x="193" y="170.054" width="1.69328" height="29.2556" transform="rotate(-38.4807 193 170.054)" fill="white"/>
<rect x="196" y="168.224" width="6.03" height="29.2556" transform="rotate(-38.4807 196 168.224)" fill="white"/>
<circle cx="217.5" cy="311.5" r="5.5" fill="#A03795"/>
<circle cx="225.5" cy="320.5" r="5.5" fill="#A03795"/>
<circle cx="217.5" cy="328.5" r="5.5" fill="#A03795"/>
<circle cx="208.5" cy="320.5" r="5.5" fill="#A03795"/>
<circle cx="211.5" cy="314.5" r="5.5" fill="#A03795"/>
<circle cx="223.5" cy="314.5" r="5.5" fill="#A03795"/>
<circle cx="223.5" cy="325.5" r="5.5" fill="#A03795"/>
<circle cx="211.5" cy="326.5" r="5.5" fill="#A03795"/>
<circle cx="217.5" cy="320.5" r="7.5" fill="#F1D6A2"/>
</svg>
