<svg width="360" height="718" viewBox="0 0 360 718" fill="none" xmlns="http://www.w3.org/2000/svg">
<path d="M120 97L173 87L227 94L229.5 167H120V97Z" fill="#2F2F2F"/>
<rect x="119" y="117" width="111" height="159" rx="55.5" fill="#AC6C3A"/>
<circle cx="147.161" cy="177.815" r="8.86866" stroke="#343434" stroke-width="3"/>
<rect x="136.792" y="181.23" width="20.7373" height="9.95392" fill="#AC6C3A"/>
<circle cx="201.909" cy="177.815" r="8.86866" stroke="#343434" stroke-width="3"/>
<rect x="191.539" y="181.23" width="20.7373" height="9.95392" fill="#AC6C3A"/>
<rect x="172.461" y="193.673" width="3.31797" height="16.5899" rx="1.65899" fill="#CB7C3F"/>
<rect x="109" y="434" width="64" height="176" fill="#EAEAEA"/>
<rect x="175" y="434" width="65" height="176" fill="#EAEAEA"/>
<path d="M109 278C109 272.477 113.477 268 119 268H230C235.523 268 240 272.477 240 278V457C240 473.569 226.569 487 210 487H139C122.431 487 109 473.569 109 457V278Z" fill="#343434"/>
<path d="M97 288C97 276.954 105.954 268 117 268H118V420H97V288Z" fill="#AC6C3A"/>
<path d="M251 288C251 276.954 242.046 268 231 268H228V419H251V288Z" fill="#AC6C3A"/>
<circle cx="108" cy="422" r="12" fill="#AC6C3A"/>
<circle r="12" transform="matrix(-1 0 0 1 240 422)" fill="#AC6C3A"/>
<path d="M88 623C88 606.431 101.431 593 118 593H173V631H88V623Z" fill="#343434"/>
<path d="M175 593H230C246.569 593 260 606.431 260 623V631H175V593Z" fill="#343434"/>
<rect x="198" y="501" width="30" height="4" rx="2" fill="#CED1D5"/>
<rect x="184" y="514" width="30" height="4" rx="2" fill="#CED1D5"/>
<rect x="204" y="527" width="18" height="4" rx="2" fill="#CED1D5"/>
<rect x="114" y="548" width="36" height="4" rx="2" fill="#CED1D5"/>
<rect x="132" y="539" width="23" height="4" rx="2" fill="#CED1D5"/>
<rect x="120" y="557" width="23" height="4" rx="2" fill="#CED1D5"/>
<path d="M194 349C194 354.741 192.575 359.746 190.483 363.184C188.347 366.693 185.937 368 184 368C182.063 368 179.653 366.693 177.517 363.184C175.425 359.746 174 354.741 174 349C174 343.259 175.425 338.254 177.517 334.816C179.653 331.307 182.063 330 184 330C185.937 330 188.347 331.307 190.483 334.816C192.575 338.254 194 343.259 194 349Z" stroke="#EAEAEA" stroke-width="8"/>
<rect x="158" y="327" width="8" height="43" fill="#EAEAEA"/>
<path d="M120 103H226V141H120V103Z" fill="#2F2F2F"/>
</svg>
