<svg xmlns="http://www.w3.org/2000/svg" viewBox="0 0 100 100" preserveAspectRatio="none">
    <defs>
        <linearGradient id="blueGradient" x2="0%" y2="100%">
            <stop offset="35%"  stop-color="#000550"/>
            <stop offset="95%"  stop-color="#000E58"/>
        </linearGradient>
    </defs>
    <polygon fill="url(#blueGradient)" points="0 0,100 0,100 100, 0 100"/>
</svg>