<svg xmlns="http://www.w3.org/2000/svg" viewBox="0 0 512 512" height="512" width="512">
    <g class="" transform="translate(0,0)" style="touch-action: none;">
        <path d="M135.688 14.47c-9.9 17.578-16.9 35.042-21.157 52.718-30 .05-60.354 6.118-90.25 19.343 30.206-1.245 58.853 1.256 85.94 7.064-1.807 20.477-.167 41.44 4.718 63.406 8.715-19.5 14.788-38.61 18.562-57.5 19.888 5.854 38.888 13.542 57 22.906-8.706 21.313-15.625 43.75-20.906 65.813 17.15-14.825 32.1-32.532 43.937-52.72 16.033 9.956 31.312 21.258 45.845 33.78-14.894 18.655-26.555 39.646-35.5 63.032 20.666-12.887 40.305-26.64 58.344-41.718 11.776 11.827 23.03 24.468 33.717 37.875-18.05 13.51-34.525 29.52-50.093 47.874 23.34-7.02 45.913-15.17 67.25-25.03 9.88 13.904 19.248 28.47 28.094 43.624-19.928 10.57-37.594 24.166-54.032 40.218 22.827-4.56 45.175-10.16 66.75-17.312 8.5 16.012 16.503 32.58 23.938 49.625-17.376 5.93-34.2 14.867-50.75 26.624 19.95-1.098 39.803-2.813 59.344-6.094 12.852 31.89 23.956 65.24 33.28 99.5 6.136-34.692 5.34-70.76-1.156-106.563 15.952-4.408 31.63-10.26 46.938-18.093-17.955-3.76-35.026-4.77-51.47-3.22-4.788-19.56-11.22-38.93-19.124-57.843 19.266-8.834 37.666-19.323 54.97-31.905-24.416.075-46.115 2.948-65.75 8.22-8.473-17.198-18.144-33.875-28.845-49.845 20.15-13.046 38.63-28.44 54.876-46.906-27.136 4.322-51.12 11.75-72.812 22.062-12.598-16.215-26.287-31.466-40.875-45.47 16.55-18.2 30.804-38.286 42.03-60.842-25.817 10.962-47.79 24.042-66.438 39.25-19.178-15.557-39.573-28.977-60.812-39.75 6.06-17.92 9.95-37.2 11.156-57.656-13.128 13.28-24.6 29.352-34.5 47.062-22.77-9.18-46.31-15.263-70.22-17.656 1.253-18.045.512-35.955-2-53.875z"
              fill="#fff" fill-opacity="1" />
    </g>
</svg>