{
  "commandId": 1,
  "date": "2021-12-15T17-15-00Z",
  "orderItems": [
    {
      "count" : 1,
      "itemName" : "regular pork ramen",
      "type" : "ramen",
      "costAtUnit" : "7.50"
    },
    {
      "count" : 2,
      "itemName" : "black soy chicken ramen",
      "type" : "ramen",
      "costAtUnit" : "8.50"
    },
    {
      "count" : 1,
      "itemName" : "classic cheesecake",
      "type" : "dessert",
      "costAtUnit" : "1.50"
    }
  ]
}