<?xml version="1.0" encoding="utf-8"?>
<!-- Generator: Adobe Illustrator 23.0.0, SVG Export Plug-In . SVG Version: 6.00 Build 0)  -->
<svg version="1.1" id="Layer_1" xmlns="http://www.w3.org/2000/svg" xmlns:xlink="http://www.w3.org/1999/xlink" x="0px" y="0px"
	 viewBox="0 0 256 64" style="enable-background:new 0 0 256 64;" xml:space="preserve">
<style type="text/css">
	.st0{fill:#0077D5;}
	.st1{fill:#0096F5;}
	.st2{fill:#1B1B1B;}
</style>
<g>
	<rect x="5.7" y="9.5" class="st0" width="11.6" height="34.9"/>
	<polygon class="st1" points="34.7,44.4 23.1,44.4 5.7,9.5 17.3,9.5 	"/>
	<polygon class="st0" points="23.1,44.4 34.7,44.4 52.1,9.5 40.5,9.5 	"/>
	<rect x="40.5" y="9.5" class="st1" width="11.6" height="34.9"/>
	<path class="st2" d="M69,45.3c-1.9,0-3.6-0.3-5.1-0.9c-1.5-0.6-2.8-1.5-3.8-2.5c-1.1-1.1-1.9-2.3-2.4-3.8c-0.6-1.4-0.8-3-0.8-4.6
		v-0.9c0-1.9,0.3-3.6,0.8-5.1c0.5-1.6,1.3-2.9,2.3-4c1-1.1,2.2-2,3.6-2.6c1.4-0.6,3-0.9,4.8-0.9c1.8,0,3.3,0.3,4.7,0.9
		c1.3,0.6,2.5,1.4,3.4,2.5c0.9,1.1,1.6,2.3,2.1,3.8c0.5,1.5,0.7,3.1,0.7,4.9v2.8H63.4c0.1,0.8,0.3,1.5,0.6,2.2
		c0.3,0.7,0.7,1.2,1.2,1.7c0.5,0.5,1.1,0.8,1.8,1.1c0.7,0.3,1.4,0.4,2.3,0.4c1.2,0,2.3-0.2,3.3-0.7c1-0.4,1.9-1.1,2.6-2.1l3.2,3.6
		c-0.4,0.6-0.9,1.1-1.5,1.6c-0.6,0.5-1.3,1-2.1,1.4c-0.8,0.4-1.7,0.7-2.7,1C71.3,45.2,70.2,45.3,69,45.3z M68.2,25.1
		c-0.7,0-1.3,0.1-1.9,0.4c-0.5,0.2-1,0.6-1.4,1c-0.4,0.4-0.7,1-0.9,1.6c-0.2,0.6-0.4,1.3-0.5,2.1h9.1v-0.5c0-0.7-0.1-1.3-0.3-1.8
		c-0.2-0.6-0.4-1-0.8-1.5c-0.4-0.4-0.8-0.7-1.4-1C69.6,25.2,69,25.1,68.2,25.1z"/>
	<path class="st2" d="M81.9,32.4c0-1.9,0.2-3.6,0.7-5.1c0.5-1.5,1.1-2.9,2-4c0.9-1.1,1.9-2,3.1-2.6c1.2-0.6,2.6-0.9,4.2-0.9
		c1.4,0,2.7,0.2,3.7,0.7c1,0.5,1.9,1.2,2.6,2l0.3-2.3h5.9V44c0,1.7-0.3,3.2-0.9,4.5c-0.6,1.3-1.4,2.4-2.4,3.3c-1,0.9-2.3,1.6-3.7,2
		c-1.4,0.5-3,0.7-4.8,0.7c-0.8,0-1.6-0.1-2.4-0.2c-0.8-0.2-1.7-0.4-2.5-0.7c-0.8-0.3-1.6-0.7-2.3-1.2c-0.7-0.5-1.4-1.1-1.9-1.7
		l2.9-4c0.8,0.9,1.7,1.5,2.6,2c1,0.5,2.1,0.7,3.3,0.7c1.7,0,3.1-0.5,4.1-1.4c1-0.9,1.5-2.3,1.5-4v-1.3c-0.7,0.8-1.6,1.4-2.6,1.9
		c-1,0.4-2.1,0.7-3.4,0.7c-1.5,0-2.9-0.3-4.1-0.9c-1.2-0.6-2.3-1.5-3.1-2.6c-0.9-1.1-1.5-2.4-2-3.9c-0.5-1.5-0.7-3.2-0.7-5V32.4z
		 M88.4,32.8c0,1,0.1,1.9,0.3,2.8c0.2,0.9,0.5,1.6,0.9,2.3c0.4,0.6,0.9,1.2,1.6,1.5c0.6,0.4,1.4,0.6,2.2,0.6c1,0,1.9-0.2,2.6-0.6
		c0.7-0.4,1.3-0.9,1.7-1.7V27.4c-0.4-0.7-1-1.3-1.7-1.7c-0.7-0.4-1.5-0.6-2.6-0.6c-0.9,0-1.6,0.2-2.2,0.6c-0.6,0.4-1.2,0.9-1.6,1.5
		c-0.4,0.7-0.7,1.4-0.9,2.3c-0.2,0.9-0.3,1.8-0.3,2.8V32.8z"/>
	<path class="st2" d="M123.6,44.8c-0.3-0.6-0.5-1.3-0.7-2.2c-0.7,0.7-1.5,1.4-2.5,1.9c-1,0.5-2.2,0.8-3.7,0.8
		c-1.2,0-2.3-0.2-3.3-0.5s-1.9-0.9-2.7-1.5c-0.7-0.7-1.3-1.4-1.8-2.3c-0.4-0.9-0.6-1.9-0.6-3c0-1.3,0.2-2.4,0.7-3.4s1.2-1.8,2.1-2.5
		c1-0.7,2.1-1.2,3.6-1.6c1.4-0.4,3.1-0.5,4.9-0.5h2.9v-1.4c0-1.1-0.3-2-0.9-2.7c-0.6-0.7-1.5-1-2.8-1c-1.1,0-2,0.3-2.6,0.8
		c-0.6,0.5-0.9,1.3-0.9,2.2h-6.6c0-1.1,0.2-2.1,0.7-3c0.5-1,1.2-1.8,2.1-2.5c0.9-0.7,2-1.3,3.3-1.7c1.3-0.4,2.7-0.6,4.3-0.6
		c1.4,0,2.7,0.2,3.9,0.5c1.2,0.4,2.3,0.9,3.1,1.6c0.9,0.7,1.6,1.6,2.1,2.7c0.5,1.1,0.7,2.3,0.7,3.8v10.4c0,0.7,0,1.3,0.1,1.9
		c0,0.6,0.1,1.1,0.2,1.5c0.1,0.4,0.2,0.8,0.3,1.2c0.1,0.4,0.3,0.7,0.4,1v0.4H123.6z M118.1,40.3c0.6,0,1.1-0.1,1.6-0.2
		s0.9-0.3,1.3-0.5c0.4-0.2,0.7-0.5,1-0.8c0.3-0.3,0.5-0.6,0.7-0.9v-4.2h-2.7c-0.9,0-1.6,0.1-2.2,0.3c-0.6,0.2-1.2,0.5-1.6,0.8
		c-0.4,0.3-0.7,0.7-0.9,1.2c-0.2,0.5-0.3,1-0.3,1.5c0,0.8,0.3,1.5,0.9,2C116.4,40,117.1,40.3,118.1,40.3z"/>
	<path class="st2" d="M142.1,14.2v6h4.2v4.8h-4.2v12.3c0,0.5,0.1,0.9,0.2,1.3c0.1,0.3,0.3,0.6,0.5,0.8c0.2,0.2,0.5,0.3,0.8,0.4
		c0.3,0.1,0.7,0.1,1.1,0.1c0.4,0,0.8,0,1.1,0c0.3,0,0.6-0.1,0.9-0.1v5c-0.5,0.2-1.1,0.3-1.8,0.4c-0.6,0.1-1.4,0.2-2.2,0.2
		c-1.1,0-2-0.1-2.9-0.4c-0.9-0.3-1.6-0.7-2.2-1.3c-0.6-0.6-1.1-1.3-1.4-2.2c-0.3-0.9-0.5-2-0.5-3.3v-13H132v-4.8h3.6v-6H142.1z"/>
	<path class="st2" d="M161.3,45.3c-1.9,0-3.6-0.3-5.1-0.9c-1.5-0.6-2.8-1.5-3.8-2.5c-1.1-1.1-1.9-2.3-2.4-3.8
		c-0.6-1.4-0.8-3-0.8-4.6v-0.9c0-1.9,0.3-3.6,0.8-5.1c0.5-1.6,1.3-2.9,2.3-4c1-1.1,2.2-2,3.6-2.6c1.4-0.6,3-0.9,4.8-0.9
		c1.8,0,3.3,0.3,4.7,0.9c1.3,0.6,2.5,1.4,3.4,2.5c0.9,1.1,1.6,2.3,2.1,3.8c0.5,1.5,0.7,3.1,0.7,4.9v2.8h-15.6
		c0.1,0.8,0.3,1.5,0.6,2.2c0.3,0.7,0.7,1.2,1.2,1.7c0.5,0.5,1.1,0.8,1.8,1.1c0.7,0.3,1.4,0.4,2.3,0.4c1.2,0,2.3-0.2,3.3-0.7
		c1-0.4,1.9-1.1,2.6-2.1l3.2,3.6c-0.4,0.6-0.9,1.1-1.5,1.6c-0.6,0.5-1.3,1-2.1,1.4c-0.8,0.4-1.7,0.7-2.7,1
		C163.6,45.2,162.5,45.3,161.3,45.3z M160.5,25.1c-0.7,0-1.3,0.1-1.9,0.4c-0.5,0.2-1,0.6-1.4,1c-0.4,0.4-0.7,1-0.9,1.6
		c-0.2,0.6-0.4,1.3-0.5,2.1h9.1v-0.5c0-0.7-0.1-1.3-0.3-1.8c-0.2-0.6-0.4-1-0.8-1.5c-0.4-0.4-0.8-0.7-1.4-1
		C161.9,25.2,161.3,25.1,160.5,25.1z"/>
	<path class="st2" d="M188.9,26.4c-0.3,0-0.7-0.1-1.2-0.1c-0.4,0-0.8-0.1-1.2-0.1c-1.3,0-2.3,0.2-3.1,0.6c-0.8,0.4-1.4,1.1-1.8,1.9
		v16.1h-6.6V20.3h6.2l0.2,2.9c0.6-1.1,1.4-1.9,2.3-2.5c0.9-0.6,2-0.9,3.2-0.9c0.3,0,0.7,0,1.1,0.1c0.4,0.1,0.7,0.1,0.9,0.2
		L188.9,26.4z"/>
	<path class="st2" d="M192,13.9c0-1,0.3-1.8,1-2.4c0.7-0.6,1.6-1,2.7-1c0.6,0,1.1,0.1,1.5,0.2c0.5,0.2,0.8,0.4,1.2,0.7
		c0.3,0.3,0.6,0.7,0.7,1.1c0.2,0.4,0.3,0.9,0.3,1.4c0,0.5-0.1,1-0.3,1.4c-0.2,0.4-0.4,0.8-0.7,1.1c-0.3,0.3-0.7,0.5-1.2,0.7
		c-0.5,0.2-1,0.2-1.5,0.2c-0.6,0-1.1-0.1-1.5-0.2c-0.5-0.2-0.8-0.4-1.2-0.7c-0.3-0.3-0.6-0.7-0.7-1.1C192.1,14.9,192,14.4,192,13.9z
		 M199,44.8h-6.6V20.3h6.6V44.8z"/>
	<path class="st2" d="M203.4,32.3c0-1.8,0.3-3.4,0.8-5c0.5-1.5,1.3-2.8,2.2-4c1-1.1,2.2-2,3.6-2.6c1.4-0.6,3.1-1,4.9-1
		c1.9,0,3.5,0.3,5,1c1.5,0.6,2.7,1.5,3.7,2.6c1,1.1,1.7,2.4,2.3,4c0.5,1.5,0.8,3.2,0.8,5v0.5c0,1.8-0.3,3.5-0.8,5
		c-0.5,1.5-1.3,2.8-2.3,3.9c-1,1.1-2.2,2-3.6,2.6c-1.4,0.6-3.1,0.9-4.9,0.9s-3.5-0.3-5-0.9c-1.4-0.6-2.7-1.5-3.7-2.6
		c-1-1.1-1.7-2.4-2.3-3.9c-0.5-1.5-0.8-3.2-0.8-5V32.3z M209.9,32.8c0,1,0.1,1.9,0.3,2.8c0.2,0.9,0.5,1.6,0.9,2.3
		c0.4,0.6,0.9,1.2,1.6,1.5c0.6,0.4,1.4,0.6,2.4,0.6c0.9,0,1.7-0.2,2.3-0.6c0.6-0.4,1.2-0.9,1.6-1.5c0.4-0.6,0.7-1.4,0.9-2.3
		c0.2-0.9,0.3-1.8,0.3-2.8v-0.5c0-1-0.1-1.9-0.3-2.8c-0.2-0.9-0.5-1.6-0.9-2.3c-0.4-0.7-0.9-1.2-1.6-1.6c-0.7-0.4-1.4-0.6-2.4-0.6
		c-0.9,0-1.7,0.2-2.3,0.6c-0.6,0.4-1.2,0.9-1.6,1.6c-0.4,0.7-0.7,1.4-0.9,2.3c-0.2,0.9-0.3,1.8-0.3,2.8V32.8z"/>
	<path class="st2" d="M244,38c0-0.3-0.1-0.7-0.2-1c-0.1-0.3-0.4-0.6-0.8-0.8c-0.4-0.2-0.9-0.5-1.5-0.7c-0.7-0.2-1.5-0.4-2.5-0.7
		c-1.3-0.3-2.4-0.6-3.5-1c-1.1-0.4-2-0.9-2.8-1.5c-0.8-0.6-1.4-1.3-1.8-2.1c-0.4-0.8-0.7-1.7-0.7-2.8c0-1,0.2-2,0.7-2.9
		c0.4-0.9,1.1-1.7,1.9-2.4c0.8-0.7,1.9-1.3,3.1-1.7c1.2-0.4,2.6-0.6,4.1-0.6c1.6,0,3,0.2,4.3,0.6c1.3,0.4,2.3,0.9,3.2,1.6
		s1.6,1.5,2,2.5c0.5,1,0.7,2,0.7,3.2h-6.6c0-0.9-0.3-1.7-0.9-2.3c-0.6-0.6-1.6-0.9-2.8-0.9c-1.1,0-2,0.2-2.6,0.7
		c-0.6,0.5-0.9,1.1-0.9,1.9c0,0.4,0.1,0.7,0.2,1c0.2,0.3,0.4,0.5,0.8,0.8c0.4,0.2,0.8,0.5,1.4,0.6c0.6,0.2,1.3,0.4,2.1,0.5
		c1.3,0.3,2.6,0.6,3.7,1c1.1,0.4,2.1,0.9,2.9,1.5c0.8,0.6,1.5,1.3,1.9,2.2c0.5,0.9,0.7,1.9,0.7,3.1c0,1.1-0.2,2.1-0.7,3
		c-0.5,0.9-1.2,1.7-2.1,2.4c-0.9,0.7-2,1.2-3.3,1.6c-1.3,0.4-2.7,0.6-4.3,0.6c-1.7,0-3.2-0.2-4.6-0.7c-1.3-0.5-2.4-1.1-3.3-1.9
		c-0.9-0.8-1.6-1.7-2-2.7c-0.5-1-0.7-2-0.7-3h6.2c0,0.6,0.2,1.2,0.4,1.6c0.2,0.5,0.6,0.8,1,1.1c0.4,0.3,0.9,0.5,1.4,0.6
		c0.5,0.1,1.1,0.2,1.7,0.2c1.3,0,2.2-0.2,2.8-0.7C243.6,39.4,244,38.8,244,38z"/>
</g>
</svg>
