{
  "name": "esp_rust_example",
  // Select between image and build propieties to pull or build the image.
  // "image": "docker.io/espressif/idf-rust:esp32_1.64.0.0",
  "build": {
    "dockerfile": "Dockerfile",
    "args": {
      "CONTAINER_USER": "esp",
      "CONTAINER_GROUP": "esp",
      "ESP_BOARD": "esp32"
    }
  },
  "settings": {
    "editor.formatOnPaste": true,
    "editor.formatOnSave": true,
    "editor.formatOnSaveMode": "file",
    "editor.formatOnType": true,
    "lldb.executable": "/usr/bin/lldb",
    "files.watcherExclude": {
      "**/target/**": true
    },
    "rust-analyzer.checkOnSave.command": "clippy",
    "rust-analyzer.checkOnSave.allTargets": false,
    "[rust]": {
      "editor.defaultFormatter": "rust-lang.rust-analyzer"
    }
  },
  "extensions": [
    "rust-lang.rust-analyzer",
    "tamasfe.even-better-toml",
    "serayuzgur.crates",
    "mutantdino.resourcemonitor",
    "yzhang.markdown-all-in-one",
    "webfreak.debug",
    "actboy168.tasks"
  ],
  "forwardPorts": [
    9012,
    9333,
    8000
  ],
  "workspaceMount": "source=${localWorkspaceFolder},target=/home/esp/esp_rust_example,type=bind,consistency=cached",
  "workspaceFolder": "/home/esp/esp_rust_example"
}
