827 469 171
545 988 179
745 124 171
639 213 144
651 212 145
132 27 122
435 486 129
236 521 144
249 74 128
646 997 179
59946 59946 92
143105 143105 52
9863 9863 74
118140 224059 386
196082 193446 360
14412 14412 165
174013 174013 166
13450 13450 46
5369 5369 73
247472 247472 89
168590 171526 334
197028 71001 383
167799 163760 352
153939 224634 386
133900 147263 375
166612 215998 373
236147 49952 443
174268 22316 383
139388 119200 344
105197 174884 383
104122 149823 375
50482 75681 340
131519 40688 354
145574 141699 375
203565 66160 383
214009 72700 383
141102 58872 354
224186 4971 386
129660 50144 354
87806 169356 383
239647 37900 443
104312 184201 383
159945 160397 290
235 177243 383
9260 90278 351
76800 45391 340
138269 222577 386
237673 31183 443
129636 61817 354
195270 214346 373
287767 254187 407
255934 325351 407
398794 327535 441
370124 492080 449
378770 492333 449
353773 337251 441
476489 431404 444
404792 384236 436
456375 349414 449
495600 321954 449
343085 407992 441
314765 398640 441
469135 465989 413
291063 288667 345
329250 300725 384
454592 319297 449
294668 417628 449
464058 413696 444
463446 383268 449
294297 403372 441
376792 494507 449
297271 301394 371
259522 384879 441
326874 361180 441
496074 395511 449
406646 419867 449
372868 279730 441
276086 435365 449
291094 351227 441
331142 428108 449
329878 312992 384
362805 257002 441
489093 388699 449
360126 421738 449
303030 489153 449
493126 289763 449
431173 426332 374
403123 297999 441
265528 257145 407
453847 457644 356
442595 377533 449
373480 301035 441
472901 394774 449
408946 358484 436
406837 400609 405
416981 417306 312
429591 416899 418
457791 482420 444
434813 268012 449
488321 263363 449
583573 677236 509
749380 743690 393
708339 523725 509
640449 515001 509
656919 593323 509
501973 510870 426
667479 713345 504
683401 546313 509
720186 618286 509
712970 549841 509
526915 684981 509
623639 705529 509
500627 579695 470
533500 581127 452
572751 583924 434
505424 563882 470
726922 637057 504
734551 656275 504
554184 681539 509
747201 660530 504
530984 687632 509
584929 530744 452
581892 577691 359
715136 540889 509
567907 538380 452
522505 536650 408
707120 618280 509
620112 697253 509
650334 507847 509
700608 707915 504
533224 571934 452
714332 702540 504
697777 619357 509
514939 631280 509
689548 648071 442
602975 665761 509
693696 631839 442
564255 635286 509
670959 658120 442
587745 641636 509
568352 731813 509
689293 556113 509
530994 580935 452
596278 695682 509
516025 532866 439
717397 535021 509
612535 553399 434
604663 529138 452
730636 745302 424
618774 609271 447
801325 787899 468
935800 782451 525
868750 896185 445
809420 953953 525
829217 867585 525
832236 960178 525
825086 783835 468
771174 966139 525
880654 955623 507
832515 751318 468
768879 933903 525
784744 887910 525
785078 941784 525
990206 762905 525
971198 899996 507
863145 961200 507
886197 796471 525
954783 782692 525
958772 763529 525
834049 844532 525
869538 768593 525
831605 851917 525
826353 838962 525
892447 877598 445
971627 864686 507
877375 843538 432
788552 929481 525
775478 792477 437
896441 966297 507
852253 835777 525
887288 784101 525
796897 973724 525
961945 910749 507
828697 990477 525
950062 896893 507
946280 914900 507
861772 926619 476
801924 801924 163
807145 807145 194
856750 856750 75
752742 752742 181
896561 896561 127
940695 940695 202
963436 963436 52
931725 931725 171
929483 929483 202
838033 838033 119
872654 872654 96
781493 781493 106
833078 833078 119
